program: Gaussian 09
title: 000208524
version: EM64L-G09RevD.01
frameworkgroup: C1[X(C21H34NO)]
method: RPBEPBE
basis: SDD
operation: Freq
keyword: #p
keyword: freq=noraman
keyword: PBEPBE/SDD
title: #p freq=noraman PBEPBE/SDD
converged: NO YES NO NO
title: Mulliken charges:
elementType: O N C C C C C C C C C C C C C C C C C C C C C H H H H H H H H H H H H H H H H H H H H H H H H H H H H H H H H H H
charge: -0.517534 -0.097763 -0.395598 -0.360186 -0.345817 0.214027 -0.527401 -0.101472 -0.465143 -0.478588 -0.323902 -0.459499 -0.442932 -0.413410 -0.412690 0.389985 -0.386562 -0.691525 -0.400401 -0.420896 -0.248118 -0.237807 -0.236421 0.249413 0.279259 0.272844 0.268502 0.270885 0.315764 0.239206 0.259219 0.217633 0.259720 0.263417 0.257665 0.263677 0.257504 0.306379 0.211776 0.208797 0.156379 0.251385 0.215616 0.199488 0.204147 0.219081 0.222251 0.193543 0.239612 0.231134 0.263224 0.350252 0.232663 0.241822 0.243837 0.244081 0.249477
chargesum: 1.00000
title: Mulliken charges with hydrogens summed into heavy atoms:
elementType: O N C C C C C C C C C C C C C C C C C C C C C
charge: -0.167282 -0.097763 0.133074 0.181160 0.240832 0.214027 -0.028975 0.116161 0.057994 0.042754 0.239981 -0.038925 -0.035167 0.001695 0.010538 0.389985 0.029231 0.042446 -0.167738 -0.179074 -0.004281 0.006274 0.013056
polarizability: 2.27842768e+02 6.77686789e+00 2.43530630e+02 -7.08252579e+00 -2.52134283e+00 1.94613979e+02
1716.lowfreq: -14.3702 -4.9236 -0.0009 -0.0008 -0.0005 11.5101 36.5642 40.3681 49.0915
frequency: 36.0249 40.2473 49.0221 57.7905 64.1217 79.3477 91.5583 112.4651 124.1926 133.3567 169.0627 174.6491 192.1887 206.6066 219.5401 241.3311 278.2782 283.0297 286.5766 295.7051 333.0020 343.8224 350.9019 378.5556 389.6721 404.8685 414.2979 427.5797 434.9115 459.3266 485.4634 489.8950 499.6071 556.3318 582.6078 616.5275 642.9880 658.7892 681.0675 712.6807 722.2357 764.0956 782.4620 785.9463 798.5850 803.0257 807.9550 830.5677 846.1960 863.0065 865.7018 870.6519 889.8576 895.7228 903.1174 918.2503 919.2819 931.0131 950.4949 967.8287 976.9014 985.9634 989.3918 992.6655 1008.3494 1009.2938 1026.4443 1037.6500 1052.0310 1054.2833 1056.9242 1069.0264 1073.4993 1081.0600 1085.5185 1089.5222 1107.5039 1114.7993 1127.9924 1139.4720 1162.7394 1177.9436 1180.4687 1193.9378 1200.2713 1212.1945 1218.1857 1222.4501 1231.4028 1248.3099 1257.6072 1261.0733 1272.5419 1280.2640 1295.1390 1305.4852 1309.8463 1312.2579 1316.1118 1317.0662 1324.8903 1327.0882 1336.8480 1338.1375 1344.0145 1345.6760 1355.1078 1363.3302 1375.1792 1377.9144 1384.4521 1393.3586 1409.6777 1434.1230 1451.2891 1451.9221 1458.4090 1462.3295 1463.9560 1471.1439 1476.3119 1477.1124 1479.7376 1480.7633 1483.0048 1490.6523 1493.8126 1507.6733 1507.8037 1588.3018 1608.4961 2903.8886 2965.9696 2971.6307 2972.4754 2974.6420 2979.4158 3004.1394 3006.6481 3020.1219 3030.5571 3031.4850 3038.9209 3039.4649 3040.2955 3041.7753 3041.8647 3044.7856 3046.9101 3052.9767 3077.7236 3085.5438 3090.1582 3091.1105 3096.7491 3104.6090 3115.1078 3117.7428 3125.0545 3132.2081 3132.9047 3145.9525 3154.2515 3172.5459 3538.3211
redmass: 3.9781 2.9003 3.0428 3.8594 3.8462 3.5654 2.1121 3.2817 2.8958 2.0573 2.8353 1.7893 2.6507 1.8721 2.8546 3.8140 2.0896 3.4868 3.1900 3.4423 2.0946 1.7557 1.3068 2.4171 2.4128 2.7692 2.4863 3.0360 3.2275 2.5211 3.2631 1.9569 2.0870 3.6292 2.6845 6.4259 3.2225 3.8504 2.1832 2.1192 2.6006 1.8809 1.4874 1.4908 1.4652 2.1573 1.5908 2.5383 2.0060 1.2726 1.8020 2.4990 2.3892 1.4306 2.5304 2.6917 2.1810 1.4691 2.3792 2.4387 1.5355 1.5922 4.6682 1.9909 1.5294 1.8851 2.3731 3.2079 1.9527 1.8315 1.6140 1.7254 2.3953 1.7270 1.6721 2.0974 2.3476 2.3660 2.2099 2.2246 1.6916 1.2737 1.3482 1.1255 1.6277 1.4071 1.2518 1.2374 1.1675 1.4282 1.2813 1.3725 1.3276 1.4211 1.2412 1.2194 1.2520 1.2713 1.3344 1.2541 1.3403 1.3202 1.2929 1.3627 1.4317 1.4647 1.3779 1.3953 2.1967 2.1077 1.3566 1.2929 1.2179 2.1638 1.0975 1.0801 1.0756 1.0859 1.0873 1.0813 1.0707 1.0951 1.2822 1.5990 1.0703 1.0665 1.0785 1.0865 1.0788 5.9895 6.0693 1.0687 1.0669 1.0685 1.0734 1.0637 1.0617 1.0385 1.0647 1.0609 1.0976 1.0616 1.0615 1.0625 1.0929 1.0631 1.0981 1.0949 1.0655 1.1032 1.1017 1.1026 1.1012 1.0971 1.0990 1.1029 1.1034 1.0881 1.1040 1.0995 1.0938 1.0906 1.0955 1.1012 1.0656
irintensity: 0.2278 0.2491 0.1202 0.6258 0.5311 0.8921 0.2580 2.5261 1.9261 1.4828 1.6133 1.6065 3.0582 0.3312 0.4690 1.5338 0.4509 3.1493 1.8593 7.0130 0.1213 26.6463 89.3437 4.8836 0.5608 0.2036 7.7926 0.6926 8.1305 0.7542 2.1082 5.0420 5.5161 9.9368 1.0573 0.1473 1.2624 9.5588 4.2471 32.9616 29.4895 35.5268 3.6863 16.2391 2.4281 8.1028 11.5277 11.0810 3.9557 0.8576 11.3493 7.5585 5.8584 6.2048 21.1778 8.9331 8.9454 2.8595 4.1383 32.1109 3.3387 3.6950 2.5066 25.3273 0.9505 6.0457 6.7632 4.9014 4.1629 1.5345 4.1244 8.5569 4.6003 2.0623 8.1569 0.1141 15.1655 0.2934 6.3530 13.0535 4.8385 2.4723 2.2962 0.0866 5.6192 2.2155 5.1404 12.7976 4.7250 5.3262 5.0635 17.0569 13.8349 21.3221 15.6325 4.8053 7.6393 14.7001 1.8925 2.4195 14.4084 0.9005 9.1995 0.4020 4.3859 5.4365 5.8346 2.5377 2.5920 0.3734 10.7994 3.9941 30.3552 10.2472 2.4833 17.3144 19.7183 9.0673 9.2582 19.6815 7.9490 1.8282 8.2710 10.9712 12.5745 38.8354 22.0738 22.0307 12.9529 2.0805 1.6694 40.1899 20.8467 21.6982 28.5444 23.0827 34.1306 5.7127 5.0508 11.1083 52.1432 11.2740 9.2332 13.6283 59.5190 14.1932 7.1646 35.3186 6.4619 72.4560 1.6668 0.6482 8.7271 24.6791 4.8300 15.9457 15.2916 10.3199 5.7292 9.0520 13.4694 3.0645 20.8118 12.5082 25.1629
temp: 298.150 k
press: 1.00000 atm
elementType: 8 7 6 6 6 6 6 6 6 6 6 6 6 6 6 6 6 6 6 6 6 6 6 1 1 1 1 1 1 1 1 1 1 1 1 1 1 1 1 1 1 1 1 1 1 1 1 1 1 1 1 1 1 1 1 1 1
symmnumber: 1
zpe: 1345906.8 jmol-1
zpe.correction: 0.512629 hartree
zpe.thermalcorrener: 0.535638 hartree
zpe.thermalcorrenthalpy: 0.536583 hartree
zpe.thermalcorrgfe: 0.461042 hartree
zpe.sumelectzpe: -948.582549 hartree
zpe.sumelectthermal: -948.559540 hartree
zpe.sumelectthermalent: -948.558596 hartree
zpe.sumelectthermalfe: -948.634136 hartree
dipole: 7.7423 -1.8191 0.8200
dipole: 7.9953
quadrupole: -87.3693 -116.4236 -124.9275
quadrupole: -5.2591 0.2029 -0.7870
quadrupole: 22.2042 -6.8501 -15.3540 -5.2591 0.2029 -0.7870
hfenergy: -949.0951783 hartree
pointgroup: C01 [X(C21H34N1O1)]
dipole: 3.1068707 -0.312801 -0.3798882 debye
polarizability: 226.1733994|0.543195|224.7727374|5.207941|-25.7315527|215.04124 unknown
InChI: InChI=1S/C21H34NO/c1-2-22(16-9-10-17-22)18-15-21(23,19-11-5-3-6-12-19)20-13-7-4-8-14-20/h3,5-6,11-12,20,23H,2,4,7-10,13-18H2,1H3
charge 1 multiplicity 1
57 atoms
O  0.04638 1.340105 0.706588
N  2.806765 -0.100877 -0.279391
C  1.650907 -0.735111 -1.090704
C  4.084826 -0.942553 -0.49109
C  2.615983 -0.214389 1.253689
C  -0.621918 0.316938 -0.142795
C  0.366194 0.082994 -1.321206
C  -1.994036 0.892839 -0.676988
C  5.004918 -0.596209 0.696794
C  4.040426 -0.147292 1.847347
C  3.035765 1.385869 -0.642796
C  -1.841644 2.097957 -1.644766
C  -2.949162 1.265665 0.493162
C  -3.217335 2.602192 -2.149551
C  -4.324649 1.752973 -0.024235
C  -0.877281 -0.982767 0.651959
C  -4.169086 2.952722 -0.985272
C  3.404329 1.647515 -2.108311
C  -1.347261 -2.140848 -0.02477
C  -0.690194 -1.052361 2.05407
C  -1.616658 -3.334123 0.68049
C  -0.965686 -2.243948 2.764508
C  -1.426966 -3.391276 2.081033
H  2.088878 -0.96842 -2.077487
H  1.420568 -1.689378 -0.58583
H  4.508057 -0.729127 -1.483405
H  3.763133 -1.997885 -0.463829
H  2.143043 -1.193396 1.435844
H  1.917899 0.573299 1.569499
H  -0.178333 -0.479292 -2.104844
H  0.602771 1.062173 -1.767653
H  -2.478192 0.064418 -1.236193
H  5.606408 -1.474528 0.980514
H  5.711966 0.208077 0.434604
H  4.111985 -0.814917 2.721095
H  4.288904 0.867642 2.198746
H  3.838062 1.742132 0.02441
H  2.102648 1.896856 -0.354228
H  -1.228769 1.825837 -2.525226
H  -1.31334 2.922872 -1.12361
H  -2.513905 2.097866 1.095462
H  -3.079465 0.404578 1.173716
H  -3.069354 3.482164 -2.803539
H  -3.68514 1.81561 -2.776814
H  -4.829003 0.918363 -0.552441
H  -4.969053 2.022758 0.833095
H  -5.156562 3.256684 -1.379261
H  -3.767062 3.823106 -0.426854
H  2.638245 1.290499 -2.816882
H  4.378164 1.214912 -2.393939
H  3.488707 2.74004 -2.245471
H  -0.648095 1.820066 1.226395
H  -1.520899 -2.118224 -1.108025
H  -0.333846 -0.170103 2.596603
H  -1.982646 -4.214063 0.140681
H  -0.827555 -2.272286 3.850854
H  -1.644433 -4.312945 2.630543
