program: Gaussian 09
title: 000208499
version: EM64L-G09RevD.01
frameworkgroup: C1[X(C18H29NO3)]
method: RPBEPBE
basis: SDD
operation: Freq
keyword: #p
keyword: freq=noraman
keyword: PBEPBE/SDD
title: #p freq=noraman PBEPBE/SDD
converged: YES YES NO NO
title: Mulliken charges:
elementType: O O O N C C C C C C C C C C C C C C C C C C H H H H H H H H H H H H H H H H H H H H H H H H H H H H H
charge: -0.262441 -0.265439 -0.217162 -0.096900 -0.161015 -0.362662 0.314765 -0.384442 -0.319993 0.229965 -0.311350 -0.728200 -0.701067 -0.361838 -0.506768 0.467967 -0.679226 -0.691417 -0.483282 -0.427643 0.257300 -0.819799 0.226375 0.231563 0.217210 0.215114 0.220451 0.224119 0.192042 0.238245 0.237186 0.222414 0.216878 0.201302 0.202934 0.261548 0.206208 0.237648 0.241718 0.217792 0.223126 0.217396 0.215116 0.211961 0.226653 0.227223 0.240452 0.259541 0.223791 0.228425 0.226217
chargesum: 0.00000
title: Mulliken charges with hydrogens summed into heavy atoms:
elementType: O O O N C C C C C C C C C C C C C C C C C C
charge: -0.262441 -0.265439 -0.217162 -0.096900 0.065360 0.086110 0.314765 0.051124 0.096168 0.229965 0.164081 -0.087607 -0.030378 -0.124190 -0.265050 0.467967 -0.020911 -0.037688 -0.256059 0.072350 0.257300 -0.141366
polarizability: 2.48453187e+02 1.37683888e+01 2.18490398e+02 -2.05706036e+01 1.09544507e+00 1.75980032e+02
1716.lowfreq: -8.0449 -5.7068 -4.3353 -0.0008 -0.0002 0.0002 11.4214 14.0101 15.3547
frequency: 10.2876 13.4503 15.1502 29.0736 37.7838 44.3676 59.9018 61.5799 67.9301 91.9785 96.2968 102.4945 139.1364 164.6666 170.6034 204.4039 212.8349 219.6299 242.9447 246.2985 266.4876 274.1429 276.2119 281.3768 291.0461 296.7977 315.7013 362.6142 383.1083 399.1839 404.3089 435.0437 458.1632 488.2113 496.4506 503.6416 531.4568 563.2554 588.3160 599.4468 674.4674 692.1845 717.2566 743.1130 747.0276 771.6104 788.1471 798.9991 821.9627 841.6376 864.7388 880.6832 891.8064 903.2275 915.9095 924.4219 949.3827 958.5891 974.5227 994.7180 1005.6639 1031.2527 1036.6482 1046.0218 1059.2359 1061.0034 1068.2517 1075.7858 1087.7982 1091.9724 1115.0582 1117.5179 1123.4323 1159.7537 1165.2255 1181.1518 1205.8364 1219.6761 1236.4599 1246.6580 1257.2474 1278.4631 1286.2447 1294.2517 1297.1210 1319.6641 1327.8369 1335.3970 1341.8727 1344.1309 1369.7738 1374.3832 1374.7594 1381.4008 1385.0500 1385.9953 1392.8056 1395.3162 1409.2418 1447.9465 1453.9836 1457.3237 1467.0860 1468.3576 1469.6295 1471.1967 1472.5672 1475.0129 1477.0463 1481.2071 1486.3670 1488.7306 1491.5439 1497.7323 1504.3430 1587.7077 1619.1121 1655.2482 2878.7476 2912.8927 2968.0542 2971.4283 2974.1923 2976.4765 2983.4643 2991.6853 2994.4801 3009.9669 3024.8959 3035.2604 3041.2009 3043.6332 3043.9706 3061.7286 3069.5496 3071.3606 3075.0206 3077.1882 3080.9757 3081.7505 3082.9758 3089.2715 3090.3632 3125.7162 3130.8252 3135.7262 3154.1473
redmass: 4.2711 3.2263 3.6944 3.3942 2.9045 3.9645 1.6006 1.5881 6.0815 2.7197 3.1471 3.0113 3.3012 1.5270 4.0343 2.1676 1.3356 2.7130 1.6185 1.7737 3.0035 1.9271 1.0885 2.0322 3.4073 2.7877 3.4846 2.9943 3.6586 2.3655 2.7764 3.3686 3.4059 2.8639 3.5679 2.9181 4.9184 4.1054 4.0012 3.3941 4.2147 3.8504 5.0122 2.8104 3.5835 1.1382 1.3248 1.2502 1.2938 3.9574 1.4268 2.7494 2.4280 2.8886 1.8772 2.0172 1.3534 1.4310 2.4770 1.6000 2.5171 3.3131 2.8237 1.5405 2.4772 1.8219 1.9915 2.1240 2.1550 2.5646 1.6755 2.9936 2.6562 1.9091 1.4703 1.7006 2.0923 1.5587 1.4675 1.4717 2.6780 1.1310 1.5341 1.3071 1.1944 1.2800 1.7141 1.3270 1.2490 1.3577 1.3546 1.2662 1.2071 1.2409 2.9949 1.2803 1.2756 1.3043 2.9804 1.0904 1.0852 1.0634 1.0497 1.0708 1.0496 1.0467 1.0575 1.0945 1.0631 1.0512 1.0606 1.0758 1.0838 1.0791 2.6185 6.1759 6.6840 9.6092 1.0711 1.0684 1.0381 1.0353 1.0361 1.0354 1.0366 1.0613 1.0830 1.0598 1.0878 1.0867 1.0761 1.0917 1.0934 1.0996 1.0989 1.0992 1.0998 1.0987 1.1005 1.1022 1.0981 1.1005 1.0999 1.0880 1.1079 1.0904 1.0950
irintensity: 0.1259 0.0191 0.0498 0.5742 0.4576 0.4315 0.0303 1.0112 1.7402 0.5206 0.3493 0.5041 1.6127 0.9211 1.0945 0.1524 0.2171 0.3578 1.2025 1.5651 1.1207 0.9965 0.1378 1.3759 4.6457 8.6551 1.6422 5.1304 13.0363 1.5846 3.0194 2.4423 3.5211 9.1900 7.7305 5.7102 6.1185 10.3117 4.9563 10.0643 12.3361 2.2886 6.9191 3.0329 0.5453 4.8397 6.5332 6.2015 42.1070 0.9685 19.4123 4.4508 12.8128 4.7079 35.5813 16.4672 1.3775 1.3025 6.6911 10.6107 60.0614 47.0377 14.4060 13.8100 8.9446 58.1652 21.8328 39.7771 45.5326 90.4966 16.0444 111.0730 94.4892 33.3833 0.5458 7.2908 24.3471 2.5864 11.8386 23.1616 67.0189 4.1638 14.8013 3.0112 10.9422 4.5852 10.7730 3.9661 4.2048 14.5477 12.0061 16.9570 11.7814 10.8261 5.8410 22.5632 9.8400 5.0144 27.6605 9.1900 25.6998 19.4980 15.8228 12.1697 8.7729 4.5767 6.6713 19.1679 10.4964 3.5522 9.4232 15.2639 5.0111 3.5443 54.7490 25.5372 23.0467 124.7315 64.8327 81.1770 46.4515 27.5741 46.2696 24.8677 26.2934 47.9671 5.7275 30.8234 9.8354 19.5297 9.2739 53.3901 2.7988 4.3372 86.6230 52.1548 43.4876 77.4622 35.1429 9.0206 19.8131 40.4323 21.7332 13.3288 14.8191 17.7586 17.7176
temp: 298.150 k
press: 1.00000 atm
elementType: 8 8 8 7 6 6 6 6 6 6 6 6 6 6 6 6 6 6 6 6 6 6 1 1 1 1 1 1 1 1 1 1 1 1 1 1 1 1 1 1 1 1 1 1 1 1 1 1 1 1 1
symmnumber: 1
zpe: 1147425.9 jmol-1
zpe.correction: 0.437031 hartree
zpe.thermalcorrener: 0.462805 hartree
zpe.thermalcorrenthalpy: 0.463749 hartree
zpe.thermalcorrgfe: 0.376364 hartree
zpe.sumelectzpe: -981.984810 hartree
zpe.sumelectthermal: -981.959036 hartree
zpe.sumelectthermalent: -981.958092 hartree
zpe.sumelectthermalfe: -982.045477 hartree
dipole: 2.3293 1.3747 -1.2774
dipole: 2.9912
quadrupole: -129.0479 -130.6723 -133.0676
quadrupole: 3.3059 -0.7957 4.2790
quadrupole: 1.8814 0.2570 -2.1383 3.3059 -0.7957 4.2790
hfenergy: -982.421841 hartree
pointgroup: C01[X(C18H29N1O3)]
dipole: 0.784819 -0.8631435 0.1548451 debye
polarizability: 242.3386651|-23.9016965|221.9603178|7.9365581|15.7180954|178.6246342 unknown
InChI: InChI=1S/C18H29NO3/c1-6-19(7-2)10-11-21-18(20)13-22-17-12-15(5)8-9-16(17)14(3)4/h8-9,12,14H,6-7,10-11,13H2,1-5H3
charge 0 multiplicity 1
51 atoms
O  -1.488881 1.570726 1.73048
O  2.015294 0.73451 2.041361
O  1.069034 2.148097 0.433544
N  4.390332 -0.487841 -0.637638
C  -3.814666 2.033108 0.266902
C  3.184666 -0.492402 0.218015
C  -3.094516 0.684954 0.186762
C  4.955262 -1.831324 -0.915407
C  4.269545 0.416209 -1.812317
C  -1.884859 0.479131 0.914026
C  3.280468 0.65818 1.241419
C  -5.309816 1.962378 -0.11622
C  -3.071368 3.083243 -0.609998
C  -3.53589 -0.38523 -0.62098
C  -1.157779 -0.727332 0.829413
C  -1.614924 -1.785421 0.000207
C  4.093213 -2.766262 -1.80809
C  5.631042 0.816549 -2.410093
C  -2.815931 -1.600614 -0.719622
C  -0.226349 1.462008 2.442518
C  0.985647 1.505527 1.499581
C  -0.816349 -3.074617 -0.101831
H  -3.742969 2.38064 1.316062
H  2.239498 -0.384205 -0.362689
H  3.124262 -1.451126 0.765217
H  5.135462 -2.323748 0.059529
H  5.949292 -1.696906 -1.379979
H  3.74699 1.329835 -1.472897
H  3.62428 -0.025244 -2.611416
H  4.070905 0.471666 1.982931
H  3.443641 1.626152 0.737393
H  -5.848768 1.200473 0.476567
H  -5.790328 2.9414 0.064605
H  -5.446542 1.725608 -1.188568
H  -3.53873 4.079886 -0.498121
H  -2.010187 3.161231 -0.317946
H  -3.118068 2.798388 -1.67799
H  -4.464646 -0.271826 -1.189487
H  -0.229759 -0.868024 1.395062
H  4.588608 -3.748661 -1.920661
H  3.946396 -2.345997 -2.81938
H  3.095489 -2.940173 -1.362881
H  5.488916 1.565424 -3.210777
H  6.162326 -0.04527 -2.853362
H  6.276905 1.2541 -1.62843
H  -3.191853 -2.404994 -1.362495
H  -0.174665 0.555021 3.072528
H  -0.195332 2.350779 3.096149
H  0.194171 -2.889839 -0.516208
H  -0.680525 -3.547863 0.889062
H  -1.318742 -3.805703 -0.758047
