program: Gaussian 09
title: 000208495
version: EM64L-G09RevD.01
frameworkgroup: C1[X(C21H34N2O3)]
method: RPBEPBE
basis: SDD
operation: Freq
keyword: #p
keyword: freq=noraman
keyword: PBEPBE/SDD
title: #p freq=noraman PBEPBE/SDD
converged: YES YES NO NO
title: Mulliken charges:
elementType: O O O N N C C C C C C C C C C C C C C C C C C C C C H H H H H H H H H H H H H H H H H H H H H H H H H H H H H H H H H H
charge: -0.232767 -0.263383 -0.242065 -0.077663 -0.089816 -0.371799 -0.354276 -0.374031 -0.384481 -0.295689 -0.333386 -0.382931 -0.318580 -0.686751 -0.156735 0.314485 0.248786 0.230915 -0.423867 -0.728230 -0.709721 -0.364541 -0.526017 0.464153 -0.475406 -0.816325 0.206554 0.183989 0.180799 0.203328 0.208895 0.195417 0.189622 0.206464 0.167933 0.197574 0.218021 0.223622 0.200969 0.215512 0.239755 0.242450 0.219625 0.209313 0.208434 0.228032 0.233464 0.256353 0.223738 0.216902 0.200567 0.203609 0.262952 0.204811 0.238353 0.252152 0.228128 0.226905 0.232424 0.223460
chargesum: 0.00000
title: Mulliken charges with hydrogens summed into heavy atoms:
elementType: O O O N N C C C C C C C C C C C C C C C C C C C C C
charge: -0.232767 -0.263383 -0.242065 -0.077663 -0.089816 0.018744 0.029851 0.030281 0.011605 0.069818 0.108257 0.033550 0.163624 -0.049380 0.071296 0.314485 0.248786 0.230915 0.065950 -0.087023 -0.038349 -0.126188 -0.273866 0.464153 -0.247278 -0.133537
polarizability: 2.73012247e+02 -1.92166254e+00 2.42421323e+02 2.43998871e+01 1.52254937e+00 2.36430917e+02
1716.lowfreq: -7.8797 -2.4809 -0.0006 0.0005 0.0008 3.8332 7.0244 11.3112 14.4499
frequency: 6.6438 10.8898 13.8805 23.8318 27.1841 29.6851 47.8687 57.0843 61.0509 64.5232 74.5396 86.0637 91.0528 126.3073 152.4414 161.5594 189.7607 210.0805 216.8448 227.2625 233.2308 237.6144 242.8053 246.8602 264.9160 281.0454 297.7744 305.5895 310.9041 335.8412 349.1954 369.4156 376.3604 390.0646 406.3814 412.1466 443.7137 461.4699 482.8353 491.9915 510.2800 529.3619 564.1790 582.5880 599.1224 622.2546 677.8787 696.4240 717.5677 744.7811 755.0785 757.5471 764.3428 782.3278 821.8610 822.9327 843.4854 859.0769 879.3654 881.2984 897.5146 907.2959 924.1193 929.7535 945.4212 949.9755 959.1150 995.5109 1004.7978 1011.4872 1021.1655 1023.1401 1046.4524 1049.7451 1051.7488 1061.5675 1062.4746 1071.8409 1092.4970 1096.7721 1112.7586 1120.8728 1126.9089 1139.8511 1148.1033 1155.0102 1157.9394 1165.4067 1187.1552 1191.9350 1197.3096 1220.5527 1230.6672 1246.1732 1252.0352 1253.1176 1268.5936 1277.1929 1286.6698 1291.6180 1295.1639 1299.9186 1303.7762 1312.2467 1322.3071 1328.7776 1333.4990 1341.0836 1350.3384 1366.0772 1373.0094 1374.9338 1384.6605 1387.0572 1392.4633 1393.7585 1395.5383 1397.6054 1409.6688 1449.8178 1450.4294 1452.8922 1455.0437 1460.6352 1466.1545 1467.4668 1469.6930 1470.0913 1471.0935 1475.2892 1477.1116 1478.2779 1480.5692 1486.3058 1489.5807 1491.0230 1504.6833 1587.3241 1618.5450 1625.2203 2827.7219 2847.0101 2860.0359 2873.1951 2879.7253 2898.8954 2970.5492 2973.7039 2973.7701 2974.2598 2986.0360 2995.4229 3001.0807 3009.5775 3027.4957 3031.5119 3039.6982 3040.2142 3043.4518 3047.9120 3049.1824 3051.2226 3060.9268 3069.1514 3072.4513 3075.3353 3075.6936 3078.1606 3083.9803 3089.5853 3125.3634 3132.7780 3135.3984 3153.2619
redmass: 4.4968 3.9250 3.1639 4.2012 3.3257 1.1191 5.9314 2.9261 1.7228 4.1304 3.3968 3.5266 3.4768 3.8805 3.2747 3.4812 2.8094 2.9599 2.6470 2.6011 1.1708 1.3418 1.8531 3.2582 1.0739 2.9423 2.7738 2.9283 2.6935 2.7075 3.0075 3.1219 2.6228 3.9664 3.0374 2.2478 3.7821 3.7053 2.8350 3.7566 4.4129 5.1057 4.2174 3.9053 3.3883 2.0522 4.3341 4.1058 5.0678 3.5701 1.1076 3.1848 2.4331 2.6480 1.8771 1.3229 1.5280 1.4325 1.2255 2.6790 1.9433 2.6053 1.3873 3.8854 2.2457 1.3495 1.4383 1.6409 2.4310 2.4799 3.0283 3.1229 1.5422 1.7819 2.5733 2.0662 2.5813 1.9424 2.4993 2.1993 2.1071 2.3795 2.0027 2.5566 2.9222 2.2006 1.9082 1.4801 1.7580 2.3607 1.3123 1.5870 1.3625 1.2884 4.0691 1.4077 1.3340 1.3189 1.5263 1.1706 1.3034 1.2514 1.3429 1.3631 1.3219 1.7200 1.3065 1.2852 1.3611 1.4196 1.3996 1.2092 3.2309 1.3427 1.2600 1.3934 1.3343 1.2701 2.9836 1.0821 1.0879 1.0836 1.0830 1.0915 1.0941 1.0676 1.0492 1.0477 1.0834 1.1037 1.0845 1.0689 1.0424 1.0602 1.0861 1.0905 2.5983 6.1525 6.6458 9.6451 1.0705 1.0710 1.0697 1.0700 1.0689 1.0696 1.0352 1.0356 1.0373 1.0364 1.0630 1.0829 1.0841 1.0595 1.0895 1.0905 1.0900 1.0805 1.0860 1.0885 1.0816 1.0973 1.0999 1.0987 1.1013 1.0999 1.0992 1.1029 1.0986 1.0997 1.0879 1.1074 1.0905 1.0950
irintensity: 0.0304 0.0083 0.2263 0.1298 0.1030 0.3454 1.4377 0.3019 0.0302 0.6603 0.3048 0.0655 1.8477 0.4270 0.8899 1.1288 4.9586 0.3856 0.4432 1.1900 0.6512 0.3694 1.2056 0.5770 0.1082 2.3276 2.5313 1.9294 5.4160 11.3630 12.0475 1.2230 2.7856 13.0257 7.6819 1.6392 1.5069 0.8446 0.3042 2.0038 3.0162 5.0176 9.7232 10.4421 8.3902 2.4528 4.7143 1.6734 6.9103 0.1797 5.8525 8.2352 5.5164 15.1504 6.0133 45.5452 0.1419 17.9932 3.7229 5.3749 1.5820 4.2588 9.4806 52.5265 50.9290 0.9942 0.9231 11.9383 65.6494 12.7017 21.7274 36.9007 17.0258 3.3701 1.1268 24.4839 10.0593 3.0369 42.8682 3.3953 35.8191 9.0122 20.7681 5.3468 89.2848 21.2867 41.6867 4.4071 27.1619 128.1530 20.9943 4.6351 1.1829 43.1371 88.7440 6.8553 26.5509 6.3539 10.0930 3.8085 2.3714 9.2888 16.3106 5.8336 3.6931 9.4281 4.1087 2.4406 17.2459 0.9502 14.6125 14.1335 4.5918 3.8589 9.9783 4.7604 9.1476 8.0130 29.0289 4.3023 4.6697 1.4724 22.8329 17.1245 2.1771 11.0410 12.8506 4.6477 1.9016 17.6822 25.0515 2.0595 12.1206 9.2862 14.6307 6.4151 55.5220 26.5869 20.8413 143.7025 72.3717 67.3083 80.2720 16.2854 141.0203 140.0776 33.1501 48.7398 57.0132 18.5045 13.9200 5.5550 29.7583 34.0556 40.5708 31.8155 17.2649 22.8527 34.9909 16.1273 42.4810 22.2679 4.7324 87.3866 82.0904 41.7417 50.0657 8.7869 19.3462 21.5490 13.2832 9.5506 14.6270 17.3436
temp: 298.150 k
press: 1.00000 atm
elementType: 8 8 8 7 7 6 6 6 6 6 6 6 6 6 6 6 6 6 6 6 6 6 6 6 6 6 1 1 1 1 1 1 1 1 1 1 1 1 1 1 1 1 1 1 1 1 1 1 1 1 1 1 1 1 1 1 1 1 1 1
symmnumber: 1
zpe: 1357795.1 jmol-1
zpe.correction: 0.517157 hartree
zpe.thermalcorrener: 0.546209 hartree
zpe.thermalcorrenthalpy: 0.547153 hartree
zpe.thermalcorrgfe: 0.450832 hartree
zpe.sumelectzpe: -1153.732613 hartree
zpe.sumelectthermal: -1153.703561 hartree
zpe.sumelectthermalent: -1153.702616 hartree
zpe.sumelectthermalfe: -1153.798938 hartree
dipole: 1.4146 -0.5817 -0.5828
dipole: 1.6368
quadrupole: -154.5089 -155.2009 -157.7815
quadrupole: -1.2960 -1.9596 -1.3628
quadrupole: 1.3215 0.6295 -1.9511 -1.2960 -1.9596 -1.3628
hfenergy: -1154.2497697 hartree
pointgroup: C01 [X(C21H34N2O3)]
dipole: 0.5700419 0.2954321 0.0496796 debye
polarizability: 265.8943707|-7.4814371|242.7054235|-27.4831805|0.1585157|243.2646923 unknown
InChI: InChI=1S/C21H34N2O3/c1-5-8-22-9-11-23(12-10-22)13-14-25-21(24)16-26-20-15-18(4)6-7-19(20)17(2)3/h6-7,15,17H,5,8-14,16H2,1-4H3
charge 0 multiplicity 1
60 atoms
O  -0.813633 -1.81147 1.476744
O  -3.518269 -1.414043 1.005265
O  -0.746118 -3.439678 -0.198602
N  5.158609 -0.064684 -0.83958
N  2.536511 -0.483689 0.337856
C  4.632944 -1.430516 -0.586956
C  4.595265 0.88616 0.150986
C  3.098223 -1.43705 -0.652721
C  3.058579 0.883328 0.092079
C  6.642116 -0.044191 -0.894171
C  1.063777 -0.555634 0.443463
C  7.222812 1.25914 -1.481996
C  0.676367 -1.676318 1.427016
C  8.75538 1.17621 -1.65338
C  -4.414898 1.059271 1.909574
C  -3.938514 0.881045 0.465906
C  -1.387405 -2.691299 0.575941
C  -3.445859 -0.385322 0.031027
C  -2.920121 -2.700415 0.686482
C  -5.358025 2.266495 2.109088
C  -3.188735 1.158001 2.864044
C  -3.911168 1.929146 -0.479396
C  -2.946227 -0.585211 -1.273742
C  -2.923297 0.486154 -2.205886
C  -3.41248 1.745059 -1.791808
C  -2.397543 0.262677 -3.614167
H  5.03511 -2.111593 -1.360269
H  4.951105 -1.816712 0.415289
H  4.916965 0.625457 1.192577
H  4.957846 1.904447 -0.074353
H  2.724176 -2.454207 -0.437083
H  2.780184 -1.169368 -1.691309
H  2.739633 1.273156 -0.906628
H  2.661102 1.5608 0.870436
H  7.094848 -0.22592 0.117258
H  6.958818 -0.887991 -1.539107
H  0.570615 -0.73717 -0.541189
H  0.677392 0.405471 0.827375
H  6.9787 2.119456 -0.828982
H  6.735672 1.448625 -2.457353
H  1.11252 -2.645549 1.130788
H  0.967001 -1.42028 2.456011
H  9.163677 2.11876 -2.060726
H  9.03539 0.360138 -2.346025
H  9.25602 0.982129 -0.685661
H  -4.966591 0.1402 2.187995
H  -3.322244 -3.131549 -0.249288
H  -3.205362 -3.355302 1.528303
H  -6.220301 2.231638 1.418098
H  -5.747472 2.271213 3.143651
H  -4.830612 3.226965 1.954897
H  -2.600303 2.068698 2.642754
H  -2.531196 0.279037 2.750535
H  -3.522598 1.211591 3.917562
H  -4.287474 2.91558 -0.189137
H  -2.572127 -1.563955 -1.594338
H  -3.40665 2.58611 -2.494883
H  -1.399039 -0.212964 -3.604845
H  -3.067796 -0.401802 -4.192633
H  -2.314501 1.214726 -4.165886
