program: Gaussian 09
title: 000208493
version: EM64L-G09RevD.01
frameworkgroup: C1[X(C17H27NO3)]
method: RPBEPBE
basis: SDD
operation: Freq
keyword: #p
keyword: freq=noraman
keyword: PBEPBE/SDD
title: #p freq=noraman PBEPBE/SDD
converged: YES YES NO NO
title: Mulliken charges:
elementType: O O O N C C C C C C C C C C C C C C C C C H H H H H H H H H H H H H H H H H H H H H H H H H H H
charge: -0.285108 -0.264049 -0.220297 -0.096328 -0.161505 0.313475 0.009568 -0.381542 0.240698 -0.728004 -0.700469 -0.361865 -0.511758 -0.691055 0.469309 -0.479875 -0.438603 -0.616273 -0.612722 0.264278 -0.819420 0.225811 0.240608 0.218313 0.203849 0.201477 0.216012 0.222028 0.262196 0.201634 0.206432 0.236830 0.209587 0.248424 0.242682 0.235564 0.226879 0.239501 0.262813 0.228436 0.192758 0.225409 0.223813 0.191759 0.228504 0.227446 0.228046 0.224732
chargesum: 0.00000
title: Mulliken charges with hydrogens summed into heavy atoms:
elementType: O O O N C C C C C C C C C C C C C C C C C
charge: -0.285108 -0.264049 -0.220297 -0.096328 0.064305 0.313475 0.250176 0.040621 0.240698 -0.088488 -0.030207 -0.125035 -0.276194 0.009639 0.469309 -0.252996 0.063711 0.030329 0.031354 0.264278 -0.139195
polarizability: 2.51378806e+02 -1.02035235e+01 2.10657789e+02 -1.38558901e+01 -4.62419728e+00 1.49675986e+02
1716.lowfreq: -17.0280 -4.9624 -0.0005 0.0005 0.0009 5.9810 8.8277 14.8394 18.0704
frequency: -12.6232 14.6044 17.9659 26.4325 30.7312 47.5893 59.1066 68.0589 83.7131 90.6229 120.1697 147.7946 168.7137 199.9281 205.2895 210.9739 215.6349 229.0748 232.1742 240.4385 254.3161 260.5212 284.2793 298.4614 309.5908 339.1406 365.0443 381.0930 398.8686 418.9467 432.0570 454.1313 459.3783 489.4672 506.4430 529.5106 561.9255 580.6499 598.7961 682.5087 697.6442 717.9150 746.4889 799.3399 820.5705 824.2028 861.6147 869.8517 881.4988 902.5398 913.3298 924.5843 928.3928 948.9192 959.5478 994.8721 1008.8576 1034.5092 1036.6512 1037.2891 1042.2946 1046.6731 1062.3210 1083.3553 1092.3252 1093.7156 1119.3991 1124.9123 1140.5454 1154.1718 1160.8219 1165.9092 1211.4454 1219.7659 1234.4405 1256.7134 1262.7216 1280.8700 1287.2030 1295.7723 1307.0899 1330.1725 1339.7677 1344.7960 1367.0296 1376.3966 1379.6448 1385.3679 1392.9030 1396.0620 1409.8932 1420.8312 1442.9574 1451.4989 1461.2615 1463.2010 1466.7242 1468.4189 1469.4035 1470.0202 1471.5670 1474.9227 1476.5904 1477.9137 1484.2307 1486.6694 1489.5994 1504.9023 1588.3331 1619.5995 1657.0747 2856.4374 2861.8734 2877.2988 2971.4576 2972.8629 2974.5315 2990.7733 2996.5681 3004.7077 3022.2351 3024.1271 3031.5745 3044.1111 3049.3399 3061.9708 3070.1710 3074.4592 3075.1164 3080.4294 3084.0321 3086.3425 3090.5926 3092.6035 3103.4205 3125.0629 3131.8569 3152.8809
redmass: 3.0762 3.4138 2.6357 1.2848 3.3133 4.8083 2.7750 5.6154 3.2978 3.0131 3.7234 3.5157 3.4334 2.0445 1.6592 1.1406 2.2071 1.3479 1.5374 1.2881 2.2078 1.3332 4.0491 2.7936 3.2064 3.5500 2.9463 1.9827 3.2442 2.8420 2.5491 3.4297 2.4875 3.6621 3.3925 4.4213 4.3212 3.5962 3.3608 4.6333 4.9257 5.0391 3.5367 4.6853 1.2997 3.5611 1.4546 4.1483 2.6311 2.6263 2.0213 1.3805 1.6657 1.3521 1.4266 1.6078 2.2091 1.6122 2.1859 3.2359 2.0346 1.5423 1.8015 1.3777 1.6811 2.0904 2.9862 2.6414 1.6343 1.9721 1.9343 1.4641 2.2811 1.5712 1.3797 3.1179 2.3629 1.5065 1.5246 1.2998 1.3561 1.7295 1.3667 1.3654 1.4454 1.2097 1.2602 2.9578 1.2647 1.2954 3.0764 1.1419 1.1504 1.0896 1.0506 1.0779 1.0689 1.0474 1.0460 1.0484 1.0571 1.1038 1.0591 1.0641 1.0619 1.0533 1.0730 2.7112 6.1760 6.7101 10.3458 1.0566 1.0626 1.0634 1.0353 1.0373 1.0361 1.0355 1.0831 1.0601 1.0734 1.0839 1.0749 1.0892 1.0977 1.0998 1.0989 1.1013 1.0999 1.1011 1.0983 1.1007 1.0998 1.0990 1.1008 1.0879 1.0902 1.0951
irintensity: 0.2429 0.0414 0.1431 0.8074 0.2080 0.4532 0.2256 1.7353 1.7461 0.6745 0.6192 1.1263 1.5617 0.5763 4.0690 0.0290 0.4201 0.4719 0.5178 0.6461 5.4085 2.0510 2.8055 2.6780 2.6652 2.6235 5.3504 3.1820 5.8623 6.1442 0.3762 1.9086 4.8495 8.4305 1.9949 3.4503 10.0992 3.5090 8.8741 6.4863 9.6041 6.4701 0.7425 10.0567 43.0437 13.4236 12.7742 2.5433 6.6367 9.1227 16.9026 3.6710 7.5190 1.6030 0.9535 8.3202 28.0057 66.7951 5.7033 66.6652 168.1597 11.2999 64.9359 34.6017 108.9512 41.3725 174.7859 114.9675 11.4553 3.7408 33.2067 0.4035 2.5158 2.0272 13.1409 62.2450 13.0099 3.4454 11.9759 2.4485 6.1182 11.3313 12.6469 2.4608 9.1620 14.7898 26.6724 5.5050 10.5868 5.9805 30.1618 2.5951 1.8221 32.5272 9.0401 7.8591 12.1451 9.7259 3.3235 17.3396 13.9986 20.1893 4.5409 35.9532 9.3030 14.5873 6.4669 57.4631 27.5708 24.1373 155.3688 71.9440 80.2291 192.7780 30.2879 49.3396 40.0091 11.1009 5.9727 31.9238 39.2037 10.5700 33.1083 29.0533 22.8127 3.2132 83.2738 3.5163 50.6872 23.6045 22.9308 50.7084 20.9028 25.4516 17.2532 14.3027 22.3267 18.8385
temp: 298.150 k
press: 1.00000 atm
elementType: 8 8 8 7 6 6 6 6 6 6 6 6 6 6 6 6 6 6 6 6 6 1 1 1 1 1 1 1 1 1 1 1 1 1 1 1 1 1 1 1 1 1 1 1 1 1 1 1
symmnumber: 1
zpe: 1070895.9 jmol-1
zpe.correction: 0.407883 hartree
zpe.thermalcorrener: 0.431676 hartree
zpe.thermalcorrenthalpy: 0.432620 hartree
zpe.thermalcorrgfe: 0.351593 hartree
zpe.sumelectzpe: -942.765532 hartree
zpe.sumelectthermal: -942.741739 hartree
zpe.sumelectthermalent: -942.740795 hartree
zpe.sumelectthermalfe: -942.821822 hartree
dipole: -3.5065 0.8352 1.6995
dipole: 3.9851
quadrupole: -110.9866 -123.5012 -130.4786
quadrupole: 3.6227 -3.8537 -2.6918
quadrupole: 10.6689 -1.8457 -8.8232 3.6227 -3.8537 -2.6918
hfenergy: -943.1734151 hartree
pointgroup: C01 [X(C17H27N1O3)]
dipole: 1.3086245 0.8621038 0.0495449 debye
polarizability: 247.0776033|21.1471951|170.0025591|4.6034429|30.323991|194.6324185 unknown
InChI: InChI=1S/C17H27NO3/c1-12(2)15-8-7-13(3)9-16(15)20-11-17(19)21-14(4)10-18(5)6/h7-9,12,14H,10-11H2,1-6H3
charge 0 multiplicity 1
48 atoms
O  2.087573 0.591319 -0.23121
O  -1.245229 -0.03463 -1.582993
O  0.895226 -1.424031 -0.221388
N  5.644332 0.204166 0.913206
C  -3.682753 -1.356722 -1.809027
C  -3.378543 -0.482248 -0.590355
C  3.168416 -0.011176 0.635444
C  4.447864 0.748854 0.232877
C  -2.105318 0.149179 -0.468999
C  -5.192156 -1.546979 -2.077914
C  -2.973692 -2.73473 -1.658076
C  -4.280987 -0.297059 0.479199
C  -1.753421 0.909267 0.666126
C  2.785544 0.153247 2.107352
C  -2.674716 1.075337 1.733683
C  -3.944553 0.466886 1.622896
C  0.085431 0.536623 -1.522237
C  6.102736 -1.08087 0.34374
C  6.742619 1.188583 1.003878
C  1.023308 -0.237774 -0.583406
C  -2.288722 1.891357 2.956413
H  -3.235047 -0.858227 -2.690765
H  3.229558 -1.083101 0.371811
H  4.327299 1.807474 0.52913
H  4.542077 0.726595 -0.8820
H  -5.67854 -2.136469 -1.27773
H  -5.337014 -2.100432 -3.02383
H  -5.718664 -0.578441 -2.161681
H  -1.89015 -2.605007 -1.495059
H  -3.120679 -3.346477 -2.568267
H  -3.390431 -3.290842 -0.797317
H  -5.272744 -0.757817 0.42323
H  2.569915 1.212863 2.335156
H  3.638945 -0.168452 2.729471
H  1.902123 -0.45752 2.358909
H  -0.76479 1.375014 0.751409
H  -4.67394 0.584584 2.432661
H  0.077339 1.606384 -1.241709
H  0.479864 0.45159 -2.550015
H  5.300694 -1.837151 0.393608
H  6.429213 -0.993641 -0.723712
H  6.955672 -1.460474 0.933496
H  7.57162 0.76191 1.596594
H  7.154138 1.491489 0.007951
H  6.388143 2.09808 1.520032
H  -2.075839 2.944296 2.690016
H  -1.37942 1.487198 3.440447
H  -3.097199 1.892482 3.707356
