program: Gaussian 09
title: 000208475
version: EM64L-G09RevD.01
frameworkgroup: C1[X(C18H30N2O2)]
method: RPBEPBE
basis: SDD
operation: Freq
keyword: #p
keyword: freq=noraman
keyword: PBEPBE/SDD
title: #p freq=noraman PBEPBE/SDD
converged: YES YES NO NO
title: Mulliken charges:
elementType: O O N N C C C C C C C C C C C C C C C C C C H H H H H H H H H H H H H H H H H H H H H H H H H H H H H H
charge: -0.310127 -0.270017 -0.088812 -0.338287 -0.340030 -0.222317 -0.386023 -0.382413 -0.316859 0.386015 0.170332 -0.700411 -0.690729 -0.376630 -0.683988 -0.695677 -0.484353 0.459461 -0.445143 -0.476687 0.180437 -0.813971 0.200407 0.219890 0.249649 0.243298 0.232284 0.219116 0.210779 0.187326 0.224093 0.227901 0.212204 0.204147 0.213162 0.215142 0.213362 0.229240 0.336558 0.214973 0.221737 0.221285 0.213296 0.211796 0.227051 0.254929 0.258963 0.246345 0.230147 0.231438 0.232327 0.223382
chargesum: 0.00000
title: Mulliken charges with hydrogens summed into heavy atoms:
elementType: O O N N C C C C C C C C C C C C C C C C C C
charge: -0.310127 -0.270017 -0.088812 -0.001729 0.080267 0.027332 0.089559 0.047483 0.094560 0.386015 0.170332 -0.056158 -0.049063 -0.147390 -0.025994 -0.043533 -0.229424 0.459461 0.060165 -0.246540 0.180437 -0.126825
polarizability: 2.44084358e+02 -6.68971558e+00 2.31861828e+02 -1.62791711e+01 -1.66449784e+00 1.79479013e+02
1716.lowfreq: -31.2586 -7.9334 -4.5972 -1.6285 -0.0007 0.0001 0.0006 11.2711 16.2519
frequency: -31.0127 11.0277 16.1222 18.5127 23.6952 32.3288 41.9191 46.4675 61.7320 81.9966 97.8662 102.1822 135.8103 156.3048 164.2152 201.7186 205.5268 212.9250 218.3308 231.6214 245.1773 262.9869 277.3953 281.0345 281.6163 297.2059 331.6181 375.9281 382.3932 392.2157 402.2890 443.3553 481.0824 484.2913 501.6674 511.6385 523.3092 570.5782 586.9923 594.8841 651.1979 665.2749 693.0091 716.7601 745.1580 747.8892 764.4028 766.6286 800.8321 823.4200 863.6697 866.4656 880.5950 896.7910 907.9225 918.0745 950.3448 953.4354 974.5358 991.0983 996.4908 1019.0812 1021.3357 1046.9188 1050.8238 1056.6707 1066.3770 1074.2005 1084.7346 1088.5214 1090.9016 1115.9280 1117.3184 1151.3076 1166.3964 1178.3353 1204.9965 1214.5577 1223.2195 1237.3507 1249.5768 1259.1560 1281.9739 1282.2908 1302.9243 1319.0043 1322.7035 1324.2406 1330.3418 1336.9049 1340.9168 1368.5782 1373.9220 1374.3595 1378.6087 1385.6034 1386.4875 1394.5003 1398.1109 1405.3910 1445.8588 1449.9198 1457.3161 1464.9018 1465.0529 1467.3443 1469.5282 1472.4458 1475.2741 1477.8300 1480.2698 1481.3659 1483.3278 1489.0146 1495.4681 1500.6029 1506.1449 1586.0106 1618.4389 1620.0915 2872.1830 2908.6519 2970.6987 2976.3536 2976.7884 2977.7440 2982.4547 2988.6757 3018.0636 3022.1480 3024.7921 3027.9023 3028.0532 3037.6310 3054.4933 3064.8943 3071.1545 3071.9422 3075.2676 3076.4426 3081.8046 3081.9603 3085.7536 3086.0340 3088.2553 3093.0414 3119.9797 3138.8576 3145.2479 3525.0566
redmass: 1.0284 3.8287 4.6544 3.2286 2.7863 3.9811 2.5244 3.8124 6.3258 3.0162 2.8096 2.9363 3.8212 2.6400 1.6105 1.8729 2.0709 1.2348 1.6342 2.5820 1.1394 2.9541 2.1459 2.3920 1.9344 3.2743 3.4135 2.9703 3.5555 3.1952 2.3268 3.5646 3.2369 2.9924 3.3427 3.1807 4.3876 4.0212 3.6466 3.3412 1.5054 2.0474 3.7269 4.8181 3.5573 2.9191 1.2895 1.2064 1.1797 1.3199 1.4233 2.7905 2.7013 2.0914 3.3873 1.1952 1.4520 1.3547 2.5003 2.2876 2.2583 2.2213 3.7729 1.5430 2.4762 1.7483 2.1599 1.8739 3.5512 2.2425 2.5675 2.6647 1.6856 1.7765 1.5126 1.7860 2.0840 1.5472 1.2169 2.0255 3.7316 1.5564 1.4346 1.2630 1.1687 1.3911 1.3139 1.2900 1.5648 1.3446 1.2255 1.2417 1.3021 1.2086 1.2689 1.2714 2.6813 1.2650 1.3168 2.7226 1.0975 1.0876 1.0648 1.0499 1.0448 1.0557 1.0469 1.0534 1.1046 1.0621 1.0762 1.0497 1.1177 1.0881 1.8070 1.1800 2.3125 6.0776 6.6810 7.9215 1.0713 1.0680 1.0346 1.0358 1.0369 1.0352 1.0377 1.0588 1.0578 1.0909 1.0612 1.0868 1.0852 1.1009 1.0975 1.1000 1.1000 1.0992 1.0985 1.0986 1.0992 1.1004 1.1054 1.0989 1.1004 1.1059 1.0867 1.0914 1.0960 1.0773
irintensity: 0.4404 0.0244 0.3315 0.3775 0.0392 0.6490 0.4724 0.8996 7.7494 0.4404 0.1832 0.1672 2.6889 3.9344 3.4555 0.9998 0.5069 0.4885 0.3633 0.4063 0.2593 1.5021 3.4811 1.6459 0.9307 16.0734 6.5454 6.6358 12.3180 2.0050 3.5606 0.8070 2.8285 9.3631 11.4148 2.9496 2.0499 23.3002 1.6023 13.1037 87.6666 30.3773 0.5451 7.8592 2.3073 3.9263 4.7316 8.5265 6.8904 39.7255 9.3772 2.3869 3.1294 3.0683 9.6046 2.9088 0.2053 0.7220 7.1843 35.6185 32.3486 31.3872 4.1784 12.5095 8.2995 46.3561 23.8509 33.8301 1.6708 20.5474 61.8385 3.2041 12.5158 47.1742 0.5534 35.2715 33.7757 8.9013 7.6707 24.7985 124.6722 14.1012 12.0745 13.8181 12.3907 6.9397 3.5367 6.4194 5.7398 2.9374 9.9793 22.5039 6.2483 13.0389 8.1191 24.7914 3.5182 15.0245 7.4298 40.2424 23.2357 25.5914 12.0589 16.3055 0.4759 8.3616 15.3890 1.8307 34.8681 3.2132 10.1176 6.9010 6.0069 33.6900 138.0515 18.2062 61.2095 28.2415 25.4104 188.0800 81.4709 59.7472 35.7252 57.8457 16.3166 28.8503 26.0419 46.4779 22.7575 11.7175 28.4729 17.5621 0.1169 19.6267 19.8461 0.0934 54.2344 40.1700 74.6012 74.3464 43.3575 37.4866 14.3464 16.8874 47.6432 16.9175 13.4590 22.3255 12.9794 42.2615
temp: 298.150 k
press: 1.00000 atm
elementType: 8 8 7 7 6 6 6 6 6 6 6 6 6 6 6 6 6 6 6 6 6 6 1 1 1 1 1 1 1 1 1 1 1 1 1 1 1 1 1 1 1 1 1 1 1 1 1 1 1 1 1 1
symmnumber: 1
zpe: 1181103.3 jmol-1
zpe.correction: 0.449859 hartree
zpe.thermalcorrener: 0.475130 hartree
zpe.thermalcorrenthalpy: 0.476074 hartree
zpe.thermalcorrgfe: 0.389709 hartree
zpe.sumelectzpe: -962.128465 hartree
zpe.sumelectthermal: -962.103193 hartree
zpe.sumelectthermalent: -962.102249 hartree
zpe.sumelectthermalfe: -962.188615 hartree
dipole: 0.3989 -1.8706 -1.5133
dipole: 2.4390
quadrupole: -128.0360 -131.7019 -139.1667
quadrupole: 6.3009 0.1721 -4.2167
quadrupole: 4.9322 1.2663 -6.1985 6.3009 0.1721 -4.2167
hfenergy: -962.5783235 hartree
pointgroup: C01 [X(C18H30N2O2)]
dipole: 0.3271391 0.6524327 0.6229464 debye
polarizability: 248.3588418|3.3311017|230.522255|9.0062217|0.0492055|176.5441028 unknown
InChI: InChI=1S/C18H30N2O2/c1-6-20(7-2)11-10-19-18(21)13-22-17-12-15(5)8-9-16(17)14(3)4/h8-9,12,14,19H,6-7,10-11,13H2,1-5H3
charge 0 multiplicity 1
52 atoms
O  1.347592 0.471846 -1.449717
O  -1.937429 -1.106126 -2.016141
N  -4.566826 0.857469 1.168676
N  -1.103957 0.186994 -0.252458
C  -3.342564 1.144862 0.38887
C  3.687076 1.640445 -0.344785
C  -2.285915 0.028562 0.609636
C  -5.194675 2.043988 1.7993
C  -5.498607 -0.061763 0.464228
C  3.379996 0.147253 -0.199375
C  2.203675 -0.431284 -0.756296
C  5.115376 1.892011 -0.893477
C  3.479007 2.379432 1.006267
C  4.237132 -0.720781 0.515549
C  -5.865777 3.065343 0.838649
C  -6.513634 -0.737855 1.404638
C  1.908214 -1.805629 -0.611745
C  2.787482 -2.659299 0.102293
C  0.269078 -0.086246 -2.275765
C  3.956588 -2.097524 0.667181
C  -1.023734 -0.393717 -1.494542
C  2.465817 -4.136861 0.251064
H  -2.921699 2.112853 0.722106
H  -3.53671 1.23323 -0.705534
H  2.96717 2.05739 -1.071327
H  -2.738294 -0.950671 0.376651
H  -1.974471 0.021252 1.668453
H  -5.943159 1.690573 2.532848
H  -4.410139 2.559449 2.386451
H  -6.043718 0.454077 -0.365235
H  -4.886071 -0.845407 -0.018784
H  5.26666 1.381354 -1.86142
H  5.282953 2.974879 -1.043584
H  5.891048 1.529133 -0.193492
H  3.660419 3.464234 0.888546
H  2.44955 2.240838 1.38448
H  4.175179 1.998268 1.776897
H  5.152107 -0.311664 0.960143
H  -0.30143 0.740463 0.059475
H  -6.275379 3.916519 1.41424
H  -6.699775 2.607737 0.276513
H  -5.140982 3.468356 0.107005
H  -7.10569 -1.487602 0.848123
H  -7.224172 -0.013721 1.84294
H  -5.9870 -1.247519 2.23083
H  0.989018 -2.228995 -1.031131
H  0.049039 0.697137 -3.021667
H  0.58872 -0.999024 -2.809713
H  4.648662 -2.737134 1.226833
H  1.467086 -4.289706 0.700959
H  2.461259 -4.648645 -0.730031
H  3.206403 -4.645773 0.891371
