program: Gaussian 09
title: 000208467
version: EM64L-G09RevD.01
frameworkgroup: C1[X(C17H28N2O2)]
method: RPBEPBE
basis: SDD
operation: Freq
keyword: #p
keyword: freq=noraman
keyword: PBEPBE/SDD
title: #p freq=noraman PBEPBE/SDD
converged: YES YES NO NO
title: Mulliken charges:
elementType: O O N N C C C C C C C C C C C C C C C C C H H H H H H H H H H H H H H H H H H H H H H H H H H H H
charge: -0.307027 -0.276613 -0.117469 -0.342282 -0.174743 0.332632 -0.433542 -0.351105 0.197925 -0.350887 -0.721512 -0.698499 -0.363597 -0.491649 0.462743 -0.477724 -0.441078 0.174068 -0.605090 -0.621031 -0.814775 0.230787 0.212963 0.234450 0.197175 0.222377 0.218595 0.248252 0.226703 0.214948 0.200179 0.212191 0.205617 0.240923 0.232226 0.255892 0.361072 0.228491 0.255120 0.246435 0.191825 0.225071 0.224520 0.193048 0.226353 0.231576 0.230782 0.231342 0.222341
chargesum: 0.00000
title: Mulliken charges with hydrogens summed into heavy atoms:
elementType: O O N N C C C C C C C C C C C C C C C C C
charge: -0.307027 -0.276613 -0.117469 0.018790 0.056044 0.332632 0.013872 0.068447 0.197925 0.115961 -0.079682 -0.039768 -0.131371 -0.235757 0.462743 -0.249233 0.060477 0.174068 0.036326 0.029947 -0.130310
polarizability: 2.13144629e+02 2.57805535e+00 2.28248760e+02 1.79814205e+01 -4.32810332e+00 1.73360385e+02
1716.lowfreq: -11.6514 -8.5400 -0.0003 0.0004 0.0007 5.7229 7.9865 15.2199 24.4008
frequency: -7.8750 15.1058 24.2449 32.8539 34.7092 46.6431 55.3372 77.0281 87.5495 108.5106 119.9058 146.2936 162.5648 200.7035 205.4714 210.7440 226.4394 233.7476 245.9851 253.3857 255.1492 292.4708 295.3610 324.1603 342.8351 354.3951 367.6393 397.3937 402.3958 426.4702 441.4559 474.8132 505.0264 521.5337 561.6086 568.6313 589.7033 596.7956 659.4827 689.3594 714.5352 722.9931 742.2021 745.3439 785.2133 821.5069 858.8788 866.1877 881.1098 890.5293 907.1194 920.6796 949.6102 956.6093 981.3392 987.3032 995.7868 1003.2430 1020.1981 1033.9336 1046.7303 1059.2798 1066.7954 1079.4915 1089.9388 1093.2341 1119.8967 1123.1280 1139.7929 1152.5254 1165.2165 1166.3758 1213.1885 1218.6511 1226.8252 1243.7287 1249.5436 1260.1533 1266.4843 1284.1628 1292.5891 1303.0702 1323.7078 1330.8953 1347.7047 1355.5116 1372.3009 1375.3757 1384.3021 1391.6438 1396.9917 1406.1743 1419.3899 1442.3293 1448.7311 1450.7803 1457.6943 1460.0612 1465.6634 1469.0734 1469.1170 1471.0854 1475.2485 1478.1779 1479.1345 1482.8064 1486.6882 1488.8544 1493.5298 1504.9313 1585.7901 1618.5394 1619.4294 2846.3800 2859.7865 2874.1647 2969.2384 2975.1426 2976.4329 2992.5880 3002.1919 3013.4700 3015.4880 3017.2501 3022.2010 3031.9801 3051.8672 3054.1157 3061.1931 3069.4957 3077.1713 3080.1310 3082.4909 3082.7243 3084.2611 3085.1350 3088.8353 3125.3604 3139.5037 3151.9403 3508.1486
redmass: 1.0577 3.8993 3.4292 3.6844 3.3629 3.3294 6.8051 3.7137 3.1076 3.0697 3.7908 3.3894 2.9031 2.0032 1.5856 2.4773 1.6356 1.4870 2.1901 1.1092 1.3491 2.9575 2.7492 2.6980 3.0004 2.0272 3.1119 2.3275 2.9643 2.3552 3.5259 3.6028 3.7347 4.3833 4.3238 3.0039 3.7052 3.4102 4.0188 3.7091 2.4250 2.0321 1.3932 2.7848 2.9198 1.3030 2.7496 1.4047 2.7962 2.8497 2.7213 1.2983 1.3525 1.4285 2.0475 2.7223 1.7010 2.3916 2.2093 1.5453 1.5423 1.8530 1.9373 1.8010 2.3817 1.4468 2.4896 3.5505 1.5310 1.8266 1.4978 1.7364 1.4638 1.5319 1.2126 1.7250 3.5924 1.8002 2.1449 1.5468 1.1955 1.3070 1.3215 1.7135 1.3775 1.3000 1.2092 1.3357 3.0034 1.2560 1.3027 2.8170 1.1430 1.1629 1.0986 1.0857 1.0565 1.0660 1.0600 1.0604 1.0472 1.0796 1.1105 1.0885 1.0566 1.0713 1.0551 1.0716 2.1845 2.5158 6.0754 7.2939 7.4114 1.0701 1.0565 1.0567 1.0349 1.0359 1.0371 1.0617 1.0836 1.0773 1.0711 1.0577 1.0739 1.0730 1.0990 1.0976 1.1000 1.0984 1.1002 1.1013 1.0991 1.1039 1.1059 1.0987 1.1003 1.0875 1.0910 1.0953 1.0771
irintensity: 0.3082 0.3892 1.0148 0.1169 0.2385 0.1196 6.0457 1.4970 0.4498 0.4661 0.5850 1.1187 10.1371 0.5935 0.5027 0.4319 0.8445 1.0213 3.1850 0.1533 1.2304 4.8061 2.2379 21.0398 10.4844 7.5129 0.3424 2.6423 3.0666 1.9876 1.1622 2.9274 2.2055 2.5323 12.3468 6.9089 3.2650 10.9247 9.2133 0.5931 59.4585 32.9390 50.6557 20.9223 1.0957 38.1776 4.3743 9.8700 9.4021 5.9900 3.7762 2.0015 1.1918 0.8488 7.7901 37.3326 6.0786 49.5391 30.7112 12.7630 12.0165 37.5816 10.4635 6.6150 40.9399 4.0521 12.2649 6.8518 5.8364 55.8973 0.3537 13.7637 6.3574 2.3935 4.3313 7.3206 104.0179 2.3818 14.2573 13.5016 41.7936 0.3303 5.8442 12.0758 2.7369 4.9928 15.3341 1.9171 4.4073 9.1488 8.8828 38.2727 5.3006 5.5378 32.9758 27.9404 20.7104 20.9247 6.3478 2.4603 18.5737 11.0989 32.7228 26.9809 1.5003 13.5071 4.1149 10.4922 204.3779 47.8975 25.3724 137.8290 139.8156 65.2198 62.6398 263.6695 40.3606 42.4046 31.0122 37.2715 3.0490 41.2290 2.9627 25.9619 50.0567 33.8074 44.3259 21.1575 3.3925 84.6811 31.4160 20.1503 40.0017 30.3163 12.0415 20.7096 33.3556 12.9937 13.3071 18.3672 55.9795
temp: 298.150 k
press: 1.00000 atm
elementType: 8 8 7 7 6 6 6 6 6 6 6 6 6 6 6 6 6 6 6 6 6 1 1 1 1 1 1 1 1 1 1 1 1 1 1 1 1 1 1 1 1 1 1 1 1 1 1 1 1
symmnumber: 1
zpe: 1109472.9 jmol-1
zpe.correction: 0.422576 hartree
zpe.thermalcorrener: 0.445903 hartree
zpe.thermalcorrenthalpy: 0.446847 hartree
zpe.thermalcorrgfe: 0.367584 hartree
zpe.sumelectzpe: -922.905892 hartree
zpe.sumelectthermal: -922.882565 hartree
zpe.sumelectthermalent: -922.881620 hartree
zpe.sumelectthermalfe: -922.960883 hartree
dipole: -1.2198 3.1597 1.6173
dipole: 3.7533
quadrupole: -118.1115 -136.5306 -126.1369
quadrupole: -7.6745 -1.3808 -6.6934
quadrupole: 8.8148 -9.6043 0.7894 -7.6745 -1.3808 -6.6934
hfenergy: -923.3284678 hartree
pointgroup: C01 [X(C17H28N2O2)]
dipole: -0.1381699 -0.3591078 -1.425651 debye
polarizability: 214.07441|17.1629917|186.1663351|14.2023464|-19.8144685|214.5130289 unknown
InChI: InChI=1S/C17H28N2O2/c1-13(2)15-8-7-14(3)11-16(15)21-12-17(20)18-9-6-10-19(4)5/h7-8,11,13,18H,6,9-10,12H2,1-5H3
charge 0 multiplicity 1
49 atoms
O  -0.356266 1.2291 0.858686
O  2.936654 1.421566 2.511836
N  2.621245 0.31978 -2.707619
N  2.289578 0.559006 0.432494
C  -2.60446 0.586204 -0.68811
C  -2.17389 -0.29985 0.48292
C  4.377117 0.841152 -0.947906
C  3.510789 1.355767 -2.119565
C  -1.017169 0.031336 1.248954
C  3.589769 -0.02134 0.072526
C  -4.121722 0.535276 -0.979988
C  -1.793901 0.216696 -1.963772
C  -2.853072 -1.485677 0.841664
C  -0.568025 -0.781004 2.312579
C  -1.267436 -1.967148 2.65591
C  -2.416308 -2.30853 1.906504
C  0.6412 1.798432 1.774875
C  2.062716 1.223714 1.609078
C  1.657964 0.914668 -3.661754
C  3.367411 -0.795684 -3.331366
C  -0.779458 -2.837529 3.801967
H  -2.338117 1.627209 -0.422473
H  5.231415 0.24242 -1.319456
H  4.807113 1.721255 -0.433471
H  4.180702 1.812406 -2.893816
H  2.857111 2.166712 -1.745292
H  3.405953 -1.026319 -0.347564
H  4.175801 -0.129668 1.001697
H  -4.717515 0.752627 -0.074965
H  -4.382669 1.283094 -1.75148
H  -4.431836 -0.453759 -1.366911
H  -2.022124 -0.818923 -2.279048
H  -2.050366 0.896648 -2.798426
H  -0.707382 0.288143 -1.780685
H  -3.752383 -1.772794 0.286155
H  0.334011 -0.518374 2.876118
H  1.527964 0.465327 -0.2473
H  -2.973996 -3.218968 2.154716
H  0.670906 2.874319 1.52842
H  0.337562 1.689593 2.831401
H  2.152748 1.370443 -4.556155
H  1.069673 1.702133 -3.15784
H  0.956447 0.138436 -4.016005
H  4.009173 -0.464474 -4.186715
H  2.653986 -1.549552 -3.708939
H  4.018561 -1.288413 -2.589623
H  0.263168 -3.169996 3.640737
H  -0.799398 -2.28815 4.762215
H  -1.407143 -3.737811 3.916392
