program: Gaussian 09
title: 000208463
version: EM64L-G09RevD.01
frameworkgroup: C1[X(C19H32N2O2)]
method: RPBEPBE
basis: SDD
operation: Freq
keyword: #p
keyword: freq=noraman
keyword: PBEPBE/SDD
title: #p freq=noraman PBEPBE/SDD
converged: YES YES NO NO
title: Mulliken charges:
elementType: O O N N C C C C C C C C C C C C C C C C C C C H H H H H H H H H H H H H H H H H H H H H H H H H H H H H H H H
charge: -0.308920 -0.275821 -0.104402 -0.338871 -0.379810 -0.353755 -0.321683 -0.322425 -0.392133 -0.163415 0.321559 0.197524 -0.695030 -0.673088 -0.725372 -0.696250 -0.361136 -0.490559 0.187830 0.462354 -0.444863 -0.475735 -0.813817 0.188022 0.235741 0.191646 0.201364 0.195625 0.189035 0.198804 0.187758 0.269534 0.217674 0.230976 0.334365 0.191197 0.277872 0.211140 0.202520 0.211202 0.223570 0.201386 0.226885 0.217276 0.214739 0.213885 0.219597 0.236971 0.255346 0.247342 0.259572 0.229893 0.232763 0.230864 0.223254
chargesum: 0.00000
title: Mulliken charges with hydrogens summed into heavy atoms:
elementType: O O N N C C C C C C C C C C C C C C C C C C C
charge: -0.308920 -0.275821 -0.104402 -0.004506 0.043952 0.039254 0.062976 0.064137 0.095075 0.067561 0.321559 0.197524 -0.014821 -0.035796 -0.079824 -0.048029 -0.124165 -0.235213 0.187830 0.462354 0.062051 -0.245842 -0.126935
polarizability: 2.64119167e+02 1.11172270e+01 2.34331118e+02 1.52657756e+01 -3.59924621e+00 1.90908475e+02
1716.lowfreq: -7.9650 -5.5146 -3.8692 -0.0008 -0.0004 -0.0004 7.7390 15.9867 19.6174
frequency: -2.2313 15.8976 19.4409 38.1117 41.3401 41.7528 47.4277 64.0088 75.6517 79.7180 87.6299 98.1528 115.0527 140.6181 157.4460 187.3901 199.1944 206.0246 216.2715 220.6124 233.6917 250.1654 266.3400 271.2959 295.9671 302.0232 307.6297 338.7015 348.6384 363.8571 403.5370 425.7264 441.2129 445.9196 461.7951 472.5723 488.8438 507.5808 521.7952 565.0752 583.3818 595.5858 636.5998 684.9335 688.7744 706.0836 717.4235 744.2320 790.6597 791.7328 807.9988 822.3474 851.9956 864.3385 878.2969 880.9311 903.7578 910.1967 916.7453 950.4564 956.0327 963.2391 990.6171 995.2809 998.6814 1020.5664 1046.8255 1048.8020 1059.0010 1067.6985 1073.4206 1077.8294 1087.8445 1090.1814 1096.5260 1117.9194 1119.7943 1153.5931 1160.5417 1166.0720 1194.9647 1215.0286 1218.8546 1225.2886 1248.1200 1253.8056 1255.1202 1281.5048 1286.9647 1291.3033 1296.5890 1299.4544 1321.8772 1327.9438 1340.5663 1349.6904 1357.9113 1366.9251 1369.7650 1376.1838 1382.2566 1387.3765 1391.3796 1397.9499 1400.2548 1406.9613 1447.4392 1452.5466 1459.2570 1464.2949 1465.6045 1467.0366 1468.1285 1469.8233 1473.8770 1475.5836 1480.5158 1482.9558 1483.8336 1488.5081 1489.9711 1497.2614 1500.6376 1513.4772 1585.1762 1619.9493 1623.8895 2848.2643 2855.4809 2870.0857 2972.3272 2976.2431 2977.0811 2979.6083 2981.3070 2982.0381 2997.9512 3003.8455 3019.9904 3020.6143 3028.2867 3033.6023 3049.6164 3055.1190 3064.7930 3071.3317 3072.7562 3074.3866 3076.9185 3078.6213 3080.1321 3086.0499 3087.7865 3088.6976 3095.6658 3126.5370 3140.8494 3153.3256 3503.8589
redmass: 3.6545 3.7963 3.9124 3.5156 1.1398 3.5582 2.9971 4.3830 3.2326 3.1710 3.0802 2.6974 2.4498 3.7841 2.9824 1.4141 1.6002 1.9716 2.5480 1.2410 2.5352 2.7478 1.0583 2.0635 3.7942 3.0554 2.0265 3.2237 2.0751 3.0214 2.9073 2.5371 3.3375 2.0045 2.5655 3.6259 2.4920 3.7855 4.5982 4.3841 3.7733 3.3602 3.8871 1.2932 2.6544 2.8472 5.2127 3.5737 1.1814 1.1884 2.5757 1.2973 1.8795 1.4096 2.5551 2.5579 2.6067 2.0886 1.3892 1.3515 1.4314 1.9870 1.9407 2.5280 2.1098 2.2181 1.5457 2.4233 1.8757 2.7417 2.2690 1.9088 2.0689 2.3881 2.9981 2.0148 2.3809 1.8784 1.7045 1.4624 1.8475 1.5077 1.5435 1.2162 2.7037 1.6946 1.7999 1.1543 1.5313 1.2315 1.1904 1.3027 1.3274 1.6501 1.3423 1.3628 1.3324 1.3216 1.2139 1.3491 3.2397 1.2352 1.2575 1.2730 1.2122 2.9238 1.0943 1.0853 1.0511 1.0635 1.0586 1.0543 1.0875 1.0477 1.0594 1.1051 1.0684 1.0716 1.0681 1.0766 1.0558 1.0609 2.5442 2.0087 6.0402 6.6754 7.7278 1.0721 1.0717 1.0712 1.0345 1.0361 1.0373 1.0371 1.0362 1.0606 1.0832 1.0648 1.0580 1.0859 1.0877 1.0938 1.0932 1.0974 1.0995 1.0991 1.0982 1.0984 1.1000 1.1010 1.0995 1.0988 1.1058 1.1002 1.0997 1.0877 1.0908 1.0953 1.0767
irintensity: 0.0781 0.0794 0.2177 0.9552 0.5672 2.7188 0.3280 4.9152 0.0629 0.9242 0.4596 0.3873 0.0709 3.4203 6.3905 0.3474 2.5808 2.0862 0.0728 0.9084 0.8084 9.6740 0.1135 3.2313 15.6502 6.3870 0.8666 5.5332 0.4310 0.6699 3.2228 3.9058 0.6656 1.8857 5.5710 3.1499 9.0957 1.8067 3.2601 10.4929 4.1265 12.7945 12.5680 89.1450 21.7055 3.4661 4.5524 2.0193 5.5699 6.7065 2.2942 39.6247 4.9891 10.5702 0.0526 8.8596 5.0161 1.5431 4.2138 1.2629 1.1311 5.4107 9.0886 38.1745 22.3300 37.3660 12.0026 23.0318 37.9779 7.0213 23.7273 17.9396 1.8715 45.7166 33.8300 1.5346 15.4967 58.0244 17.2427 1.1814 31.8646 9.6685 3.9510 4.1848 130.6732 42.0735 12.4226 12.0894 12.0276 9.8927 8.2070 0.5038 8.0739 9.7958 7.1872 4.1343 1.9582 3.0646 11.3749 0.8879 4.5075 23.0218 9.3995 9.2744 14.6810 40.1348 25.2655 18.6640 7.4745 1.5267 2.8877 11.7634 26.5512 14.9564 2.4520 27.0237 11.2157 8.3216 14.4673 16.5919 7.3328 24.2856 87.9644 100.6977 28.9397 26.3900 209.2222 35.9404 59.7660 228.7873 38.4782 41.9807 24.0464 45.1831 42.9724 29.4929 4.0751 33.3421 20.4456 17.3852 51.3782 9.7083 59.1052 19.8642 4.9065 75.2538 54.9441 44.0320 45.9420 5.8591 49.7961 22.1431 8.0018 46.3712 14.3722 12.5870 14.3563 17.2740 52.5576
temp: 298.150 k
press: 1.00000 atm
elementType: 8 8 7 7 6 6 6 6 6 6 6 6 6 6 6 6 6 6 6 6 6 6 6 1 1 1 1 1 1 1 1 1 1 1 1 1 1 1 1 1 1 1 1 1 1 1 1 1 1 1 1 1 1 1 1
symmnumber: 1
zpe: 1255409.2 jmol-1
zpe.correction: 0.478160 hartree
zpe.thermalcorrener: 0.504296 hartree
zpe.thermalcorrenthalpy: 0.505240 hartree
zpe.thermalcorrgfe: 0.419345 hartree
zpe.sumelectzpe: -1001.350715 hartree
zpe.sumelectthermal: -1001.324578 hartree
zpe.sumelectthermalent: -1001.323634 hartree
zpe.sumelectthermalfe: -1001.409529 hartree
dipole: -1.1118 -2.0691 -1.4632
dipole: 2.7673
quadrupole: -137.3451 -138.4092 -141.3692
quadrupole: -6.6434 -0.5740 -3.4299
quadrupole: 1.6960 0.6320 -2.3280 -6.6434 -0.5740 -3.4299
hfenergy: -1001.8288746 hartree
pointgroup: C01 [X(C19H32N2O2)]
dipole: -0.1236858 0.660709 0.8564519 debye
polarizability: 250.8631648|-8.3875835|235.6503369|-28.0224296|16.3464333|202.8452592 unknown
InChI: InChI=1S/C19H32N2O2/c1-6-21(7-2)12-8-11-20-19(22)14-23-18-13-16(5)9-10-17(18)15(3)4/h9-10,13,15,20H,6-8,11-12,14H2,1-5H3
charge 0 multiplicity 1
55 atoms
O  -1.77612 1.563776 -0.654659
O  0.766844 -0.642727 -2.161001
N  4.757764 -0.497782 -0.780898
N  0.6629 0.443331 -0.082127
C  3.910388 0.724648 -0.724802
C  3.073415 0.789873 0.575431
C  5.053497 -0.927477 -2.180411
C  5.989112 -0.367105 0.046625
C  1.852839 -0.164274 0.546376
C  -3.412782 3.059233 1.054791
C  -3.557745 1.538046 0.958618
C  -2.710984 0.788722 0.089474
C  3.924201 -1.769342 -2.802612
C  6.549482 -1.727665 0.503683
C  -4.693685 3.773801 1.542075
C  -2.206359 3.433771 1.963773
C  -4.491264 0.800507 1.720581
C  -2.794645 -0.616366 -0.010801
C  0.207548 0.151565 -1.342216
C  -3.742746 -1.335753 0.762736
C  -1.064184 0.917448 -1.764718
C  -4.588677 -0.608227 1.630482
C  -3.834859 -2.847904 0.647056
H  4.528669 1.653088 -0.821777
H  3.222134 0.707957 -1.589546
H  2.725659 1.828244 0.750185
H  3.714451 0.522285 1.437134
H  5.979935 -1.530863 -2.161058
H  5.272792 -0.041414 -2.827629
H  5.73766 0.227026 0.945392
H  6.783337 0.209091 -0.4941
H  2.118791 -1.073395 -0.020682
H  1.574876 -0.467336 1.573358
H  -3.177269 3.427303 0.037294
H  0.106312 1.113235 0.458044
H  4.165569 -2.017556 -3.854289
H  2.951987 -1.24794 -2.783877
H  3.801959 -2.712143 -2.239785
H  7.451471 -1.586965 1.128855
H  6.831543 -2.364298 -0.354273
H  5.789704 -2.27198 1.091435
H  -4.918747 3.53743 2.599317
H  -5.572122 3.494304 0.932511
H  -4.56264 4.869313 1.473626
H  -2.369233 3.07282 2.996438
H  -2.072075 4.531197 1.998453
H  -1.269881 2.988726 1.582799
H  -5.168671 1.336187 2.393843
H  -2.121245 -1.173262 -0.671477
H  -1.719537 0.230005 -2.328956
H  -0.766708 1.744795 -2.43199
H  -5.329272 -1.141673 2.237397
H  -4.171479 -3.154247 -0.361673
H  -2.853569 -3.327458 0.820598
H  -4.548742 -3.262875 1.378982
