program: Gaussian 09
title: 000208451
version: EM64L-G09RevD.01
frameworkgroup: C1[X(C16H25N3O2)]
method: RPBEPBE
basis: SDD
operation: Freq
keyword: #p
keyword: freq=noraman
keyword: PBEPBE/SDD
title: #p freq=noraman PBEPBE/SDD
converged: YES YES NO NO
title: Mulliken charges:
elementType: O O N N N C C C C C C C C C C C C C C C C H H H H H H H H H H H H H H H H H H H H H H H H H
charge: -0.281323 -0.269644 -0.236209 -0.251255 -0.202029 0.026155 -0.442159 -0.443748 -0.396028 -0.396840 -0.391020 0.269954 0.122907 -0.385917 -0.390857 -0.437250 -0.446727 0.217504 0.134378 -0.809971 -0.609485 0.206878 0.262365 0.199338 0.199791 0.261426 0.204956 0.187344 0.187386 0.205122 0.199147 0.204167 0.219677 0.209877 0.207862 0.233685 0.223723 0.210095 0.216254 0.242531 0.238230 0.238891 0.297691 0.247134 0.268820 0.247173
chargesum: 0.00000
title: Mulliken charges with hydrogens summed into heavy atoms:
elementType: O O N N N C C C C C C C C C C C C C C C C
charge: -0.281323 -0.269644 -0.236209 -0.251255 -0.202029 0.233033 0.019545 0.017469 -0.003728 -0.004333 0.012295 0.269954 0.122907 0.043637 0.050690 -0.003432 0.012058 0.217504 0.134378 -0.035159 0.153642
polarizability: 2.67472706e+02 -2.16141204e+00 1.89258181e+02 -4.83302052e-01 9.25460992e-01 1.46153274e+02
1716.lowfreq: -14.1661 -8.0355 -0.0007 -0.0004 0.0004 6.8857 30.3066 32.8690 44.6994
frequency: 28.7430 32.6850 44.2868 63.2101 73.1432 87.4038 107.1854 116.3677 153.8357 172.4069 185.4712 208.8381 217.8226 222.9742 251.0362 256.2328 279.0503 296.2241 333.3698 344.8306 379.2674 386.0247 393.9432 423.9361 431.0881 447.8067 460.2863 473.5975 486.0058 561.8338 574.6998 598.6949 613.3765 669.6300 716.1318 720.0861 755.4889 785.4405 790.6022 811.2440 840.8567 853.3621 863.3552 890.4474 898.4048 909.2284 912.8737 920.5464 921.0209 957.3260 972.7462 1006.2383 1037.8941 1042.7970 1045.0234 1047.4787 1057.0473 1059.6514 1075.0921 1091.4066 1108.0196 1109.3649 1120.2751 1128.6454 1146.7349 1150.1913 1162.3550 1176.5337 1195.1364 1224.9225 1234.0861 1240.2781 1247.5380 1259.0695 1263.2246 1285.4284 1297.4145 1306.0415 1311.6668 1316.4758 1329.8375 1330.1944 1333.6079 1335.1292 1339.7548 1342.7258 1345.5032 1369.4546 1377.0219 1406.3420 1431.7377 1449.1029 1463.0226 1463.5969 1465.3253 1467.4193 1472.2314 1474.2463 1474.5379 1477.1474 1480.1467 1487.3594 1489.5712 1495.5814 1557.3619 1599.0165 1616.0743 2940.1872 2957.3709 2959.7306 2961.2062 2976.5556 2977.1434 2992.7156 2995.2320 2997.3521 3011.3303 3013.5707 3017.6095 3030.6454 3033.8686 3039.0762 3042.0809 3047.1155 3060.4260 3072.4868 3073.7322 3083.9885 3090.0343 3094.3061 3102.2059 3139.5387
redmass: 3.5512 3.2688 3.2484 3.9505 3.2030 3.3341 3.3756 1.0449 3.5235 3.6423 4.8554 3.1569 1.8165 4.1352 2.4882 2.3524 2.3142 1.2603 2.0596 2.6789 4.1358 4.9627 6.4692 4.8256 3.5570 4.1693 3.4069 6.2723 1.7059 1.9250 4.6529 4.5470 6.1484 3.4670 3.6658 8.8247 9.2064 2.4643 1.4697 2.7416 2.0147 1.8372 1.9160 1.9187 1.6145 2.1951 3.2798 1.7216 1.6835 2.4206 1.6796 2.9746 1.9103 1.9730 2.3319 1.4825 2.1039 1.1787 1.3845 3.3527 2.6133 4.9297 1.8050 1.3152 2.4199 1.3597 2.0963 3.3447 1.5866 1.4072 1.3045 2.2410 1.4772 1.2855 1.3981 4.1199 1.3656 1.3095 1.2508 1.7282 1.3260 1.3335 2.7480 1.4709 1.4551 1.4519 1.4573 1.7026 1.3003 1.6471 1.6396 1.1025 1.0921 1.0874 1.0882 1.0930 1.0836 1.0555 1.0860 1.0927 1.0904 1.0900 1.1140 1.0576 7.8241 7.1281 8.7536 1.0634 1.0671 1.0647 1.0647 1.0374 1.0611 1.0642 1.0654 1.0742 1.0329 1.0707 1.0783 1.0969 1.0938 1.0952 1.1017 1.0861 1.0980 1.1021 1.0989 1.0969 1.1062 1.0981 1.1019 1.1022
irintensity: 0.4396 0.0728 0.4840 0.3148 0.3759 1.0320 5.7622 0.1568 1.9572 1.6466 2.5249 1.0552 0.0866 1.9449 0.1234 1.7597 0.6015 0.9610 2.5945 9.4222 1.0523 1.1911 11.7220 21.7190 4.9324 12.4531 0.8392 0.1803 5.9858 4.4184 2.9011 6.7425 16.6207 2.9012 2.3543 4.3078 15.7260 0.7608 0.6101 1.7812 7.5646 11.6630 8.0264 6.6161 17.1349 5.5717 1.7997 0.1863 2.2896 3.9525 8.3400 40.9680 15.4800 3.7257 1.4806 1.1538 3.0113 2.3708 0.4668 20.7723 0.3986 24.4510 1.4546 0.0261 12.2612 3.0786 3.0610 28.3995 0.1890 37.9104 10.6364 18.6105 6.8659 0.6418 12.6723 128.8478 3.9171 0.9131 2.9366 136.9084 2.1696 2.0348 50.8004 5.2929 6.8790 0.4892 0.1582 16.4631 33.2505 16.7607 135.1759 6.9517 11.3606 5.6295 5.8407 7.0532 11.0590 11.1648 15.2079 5.4924 14.3717 7.5671 21.3840 12.0071 438.2739 319.7648 196.5794 70.9167 66.7932 25.3621 49.8453 40.9124 27.6613 49.2672 22.2802 11.2761 29.5380 56.4441 56.2063 61.4723 61.8075 17.8432 54.9717 3.5519 12.9117 32.7797 0.9657 40.3547 57.2784 0.3479 16.9187 1.1050
temp: 298.150 k
press: 1.00000 atm
elementType: 8 8 7 7 7 6 6 6 6 6 6 6 6 6 6 6 6 6 6 6 6 1 1 1 1 1 1 1 1 1 1 1 1 1 1 1 1 1 1 1 1 1 1 1 1 1
symmnumber: 1
zpe: 1036104.0 jmol-1
zpe.correction: 0.394631 hartree
zpe.thermalcorrener: 0.415101 hartree
zpe.thermalcorrenthalpy: 0.416045 hartree
zpe.thermalcorrgfe: 0.345045 hartree
zpe.sumelectzpe: -937.811189 hartree
zpe.sumelectthermal: -937.790719 hartree
zpe.sumelectthermalent: -937.789775 hartree
zpe.sumelectthermalfe: -937.860775 hartree
dipole: 1.5519 -3.5555 0.0035
dipole: 3.8794
quadrupole: -127.9205 -126.6052 -124.4111
quadrupole: -0.6246 0.0022 -0.4791
quadrupole: -1.6082 -0.2929 1.9012 -0.6246 0.0022 -0.4791
hfenergy: -938.2058201 hartree
pointgroup: C01 [X(C16H25N3O2)]
dipole: 0.5919404 1.4016281 -0.1208167 debye
polarizability: 267.3965553|3.2616536|189.169269|0.6336774|-2.7879121|146.3183365 unknown
InChI: InChI=1S/C16H25N3O2/c1-12-14(18-10-6-7-11-18)15(20)17(2)16(21)19(12)13-8-4-3-5-9-13/h13H,3-11H2,1-2H3
charge 0 multiplicity 1
46 atoms
O  1.942892 -2.088246 0.202499
O  -2.725074 -1.868563 0.065151
N  0.937781 0.045576 0.12509
N  -2.687265 1.007681 0.088632
N  -0.380977 -1.960895 0.176777
C  2.299901 0.687815 0.02826
C  3.170052 0.449715 1.288663
C  3.042076 0.290131 -1.273299
C  4.503628 1.228963 1.162257
C  4.373009 1.074275 -1.381941
C  5.260113 0.8504 -0.1335
C  -0.238602 0.823117 0.135828
C  -1.494756 0.220852 0.130991
C  -3.365825 1.111348 -1.244021
C  -3.714829 0.79386 1.166154
C  -4.81431 1.504205 -0.883137
C  -5.067244 0.698655 0.417708
C  0.898446 -1.37199 0.17331
C  -1.617928 -1.244817 0.117203
C  -0.132559 2.330284 0.152362
C  -0.415854 -3.440524 0.20328
H  2.109924 1.772788 -0.032373
H  3.372076 -0.630019 1.391694
H  2.616651 0.777002 2.190677
H  2.397521 0.503773 -2.148348
H  3.246431 -0.793958 -1.261644
H  5.133639 1.024025 2.04873
H  4.301431 2.321155 1.160384
H  4.162609 2.159559 -1.48957
H  4.911261 0.761975 -2.297061
H  6.192099 1.442148 -0.216287
H  5.556413 -0.21683 -0.0839
H  -3.353165 0.134762 -1.775397
H  -2.864477 1.864298 -1.882135
H  -3.701461 1.652044 1.868729
H  -3.505989 -0.12891 1.737053
H  -5.524644 1.254799 -1.690025
H  -4.87916 2.590827 -0.685833
H  -5.910237 1.094434 1.010325
H  -5.272234 -0.35703 0.167575
H  0.302166 2.73229 -0.781896
H  0.478297 2.693541 0.998812
H  -1.160134 2.714495 0.254053
H  0.117611 -3.848558 -0.670915
H  -1.474126 -3.738518 0.185315
H  0.08092 -3.813135 1.113973
