program: Gaussian 09
title: 000208450
version: EM64L-G09RevD.01
frameworkgroup: C1[X(C15H18N2O)]
method: RPBEPBE
basis: SDD
operation: Freq
keyword: #p
keyword: freq=noraman
keyword: PBEPBE/SDD
title: #p freq=noraman PBEPBE/SDD
converged: YES YES NO NO
title: Mulliken charges:
elementType: O N N C C C C C C C C C C C C C C C H H H H H H H H H H H H H H H H H H
charge: -0.274167 -0.078170 -0.034624 -0.443192 -0.427206 -0.441345 -0.441665 -0.358653 -0.301652 0.334978 0.201638 -0.029117 -0.324457 -0.364482 -0.304918 -0.380392 -0.241024 -0.220325 0.217864 0.232779 0.213381 0.233227 0.220226 0.226250 0.226542 0.223660 0.206365 0.222222 0.232027 0.216489 0.245497 0.261221 0.260080 0.234535 0.227296 0.229111
chargesum: 0.00000
title: Mulliken charges with hydrogens summed into heavy atoms:
elementType: O N N C C C C C C C C C C C C C C C
charge: -0.274167 -0.078170 -0.034624 0.007451 0.019402 0.005131 0.008537 0.069934 0.146864 0.334978 0.201638 -0.029117 -0.078960 -0.103261 -0.044838 -0.145857 -0.013728 0.008786
polarizability: 2.40663434e+02 1.36784255e+01 1.96637775e+02 -6.34483151e+00 1.19617816e+00 1.04009478e+02
1716.lowfreq: -17.4275 -4.5770 -0.0002 0.0005 0.0008 4.2468 18.6097 23.6514 46.0027
frequency: 14.9462 23.5601 46.0000 58.2261 77.8426 113.6571 137.6102 147.8769 178.5200 187.5934 248.2502 260.3892 338.2760 390.8199 423.0152 424.7928 472.5770 479.7536 504.5795 525.9316 593.9685 601.8123 623.4182 645.7228 648.9617 715.6630 763.2023 778.0557 789.4727 804.4924 812.5246 823.5142 836.7596 840.8672 855.1390 876.9646 886.1880 908.6850 933.1654 943.0217 944.3742 973.2324 997.7642 1016.7159 1022.1581 1035.3417 1051.8497 1059.5456 1072.6694 1088.1585 1100.0608 1134.5210 1147.1506 1165.6693 1173.0620 1183.9955 1216.9298 1220.2521 1228.5387 1248.3225 1251.6332 1265.9011 1284.7360 1289.2080 1298.9799 1311.9022 1319.5852 1327.8165 1335.6982 1375.6208 1388.4891 1397.6465 1428.0275 1452.8906 1461.8060 1464.1589 1471.2846 1475.9942 1480.9215 1488.7243 1505.8874 1556.4159 1575.7893 1624.5649 2913.8672 2974.6799 2988.0432 2997.8555 3004.3415 3020.2648 3038.8371 3054.3447 3061.8450 3069.6419 3077.7883 3090.8192 3119.4906 3130.5072 3146.9000 3165.3910 3173.0238 3174.9860
redmass: 3.2965 4.6401 4.1543 1.8269 3.1576 3.4234 2.2719 4.1793 5.0473 3.7360 3.3079 5.9128 3.5149 2.3174 2.6439 3.1221 3.1826 5.0520 7.1928 7.4496 3.7227 6.2812 2.3228 3.0653 3.4209 5.0002 1.8113 1.4164 2.5482 5.6260 1.3475 2.2261 1.3282 2.6731 2.6972 3.5999 1.6209 2.5755 1.6003 1.4522 6.4278 1.3660 1.3198 2.4152 2.8408 2.3764 2.3937 2.1236 1.8332 2.8622 2.6915 1.7396 1.5022 1.1548 1.2758 1.2123 1.1806 1.9879 1.3982 2.0630 1.4188 2.0324 1.3095 1.1345 1.2562 1.2229 1.5468 1.3646 3.7491 1.5639 1.7304 3.4058 2.8040 2.5808 1.1056 1.0821 1.0816 1.1069 1.1083 1.0943 3.5764 6.9836 6.7118 6.8528 1.0688 1.0574 1.0654 1.0626 1.0598 1.0642 1.0957 1.1017 1.1034 1.1017 1.1016 1.1059 1.0901 1.0859 1.0901 1.0949 1.0994 1.0939
irintensity: 0.0872 0.1337 0.1287 0.0052 0.2369 0.5902 1.8914 5.6978 1.3484 1.6303 5.8818 0.9578 1.0265 7.0246 2.6627 6.6431 0.8214 5.3821 4.2367 2.6533 2.9464 5.5840 5.0884 7.8097 3.7561 20.6574 17.4260 58.5215 14.9658 2.3470 26.3019 14.0143 27.8243 4.5370 6.5707 14.4557 0.8181 2.3383 15.2641 2.5877 64.8501 3.0734 0.0176 21.2323 11.7833 11.1702 25.9729 76.5450 17.1879 76.0414 7.0671 2.9503 11.1788 9.5415 3.7657 1.4492 2.6883 0.0740 9.9450 102.2353 38.3256 55.5138 5.3968 2.2645 2.4539 3.5089 13.4820 4.3936 29.5041 43.8355 0.3573 37.9819 37.8406 11.5129 4.9483 1.8232 12.5968 31.0870 11.6103 7.9973 115.0932 43.6131 94.0691 10.0703 46.9285 29.0351 52.1725 37.3351 43.3043 48.5517 2.5743 14.3377 39.6898 0.8691 30.4891 110.0497 28.3901 4.9967 13.1011 13.0829 29.2586 7.9460
temp: 298.150 k
press: 1.00000 atm
elementType: 8 7 7 6 6 6 6 6 6 6 6 6 6 6 6 6 6 6 1 1 1 1 1 1 1 1 1 1 1 1 1 1 1 1 1 1
symmnumber: 1
zpe: 788652.7 jmol-1
zpe.correction: 0.300382 hartree
zpe.thermalcorrener: 0.316286 hartree
zpe.thermalcorrenthalpy: 0.317230 hartree
zpe.thermalcorrgfe: 0.253954 hartree
zpe.sumelectzpe: -765.774502 hartree
zpe.sumelectthermal: -765.758598 hartree
zpe.sumelectthermalent: -765.757654 hartree
zpe.sumelectthermalfe: -765.820930 hartree
dipole: 4.5882 -1.4732 0.2660
dipole: 4.8262
quadrupole: -104.8347 -101.5763 -109.8484
quadrupole: 7.7026 1.2745 1.1861
quadrupole: 0.5851 3.8435 -4.4286 7.7026 1.2745 1.1861
hfenergy: -766.0748845 hartree
pointgroup: C01 [X(C15H18N2O1)]
dipole: -1.8390073 0.4241102 0.2087872 debye
polarizability: 238.3028627|11.2895261|186.6795974|15.923076|31.0569666|116.3282271 unknown
InChI: InChI=1S/C15H18N2O/c1-2-6-14-13(5-1)15(7-8-16-14)18-12-11-17-9-3-4-10-17/h1-2,5-8H,3-4,9-12H2
charge 0 multiplicity 1
36 atoms
O  -0.179051 0.217676 -0.205822
N  -3.808261 -0.399838 -0.814177
N  3.722149 -1.494193 -0.364146
C  -4.946673 0.451546 -1.265725
C  -4.392063 -1.17631 0.322774
C  -5.679531 0.925845 0.032098
C  -5.396331 -0.217056 1.062227
C  -2.579746 0.354242 -0.450392
C  -1.359975 -0.553674 -0.650255
C  1.068751 -0.392588 -0.283058
C  2.185856 0.407043 0.158366
C  3.500255 -0.196546 0.096491
C  1.297891 -1.694932 -0.747729
C  2.041914 1.74443 0.642327
C  4.630087 0.569721 0.525709
C  2.64046 -2.188178 -0.763765
C  3.166002 2.467316 1.053791
C  4.467312 1.876303 0.995149
H  -5.62819 -0.175395 -1.872745
H  -4.589546 1.277689 -1.903159
H  -3.59528 -1.555661 0.985758
H  -4.933706 -2.049236 -0.086736
H  -6.758965 1.08323 -0.137565
H  -5.254566 1.882589 0.385804
H  -4.956358 0.186424 1.990961
H  -6.318387 -0.755879 1.342438
H  -2.58097 0.737489 0.596249
H  -2.482905 1.227816 -1.119234
H  -1.257691 -0.828427 -1.717026
H  -1.447068 -1.479302 -0.04656
H  0.488964 -2.340491 -1.097456
H  1.041433 2.185237 0.682052
H  5.612557 0.0911 0.468917
H  2.82774 -3.20704 -1.125068
H  3.052791 3.492386 1.423554
H  5.339799 2.453866 1.320449
