program: Gaussian 09
title: 000208428
version: EM64L-G09RevD.01
frameworkgroup: C1[X(C16H19N3O2)]
method: RPBEPBE
basis: SDD
operation: Freq
keyword: #p
keyword: freq=noraman
keyword: PBEPBE/SDD
title: #p freq=noraman PBEPBE/SDD
converged: YES YES NO NO
title: Mulliken charges:
elementType: O O N N N C C C C C C C C C C C C C C C C H H H H H H H H H H H H H H H H H H H
charge: -0.265022 -0.248246 -0.342829 -0.195885 -0.226624 0.249408 0.089306 0.168933 0.199924 0.462673 -0.428826 -0.780579 -0.634632 -0.634600 -0.335153 -0.350842 -0.027452 -0.215699 -0.214634 -0.232534 -0.558516 0.250619 0.238167 0.249138 0.288129 0.250446 0.220439 0.242552 0.212749 0.220667 0.211999 0.245020 0.252602 0.252436 0.248427 0.232313 0.232277 0.233224 0.213047 0.227578
chargesum: 0.00000
title: Mulliken charges with hydrogens summed into heavy atoms:
elementType: O O N N N C C C C C C C C C C C C C C C C
charge: -0.265022 -0.248246 -0.342829 -0.195885 -0.226624 0.249408 0.089306 0.168933 0.199924 0.462673 0.059961 0.007134 0.041108 0.043086 -0.082551 -0.098406 0.220975 0.016614 0.017643 0.000690 -0.117890
polarizability: 2.56536587e+02 -8.86174674e+00 1.94099361e+02 -4.46899935e-01 1.06253214e+01 1.49114251e+02
1716.lowfreq: -5.9466 -4.6532 -0.0006 -0.0005 0.0008 5.8261 19.0890 32.9166 42.3668
frequency: 17.9716 32.9021 42.3471 49.9396 64.9831 71.9206 75.2360 88.8053 152.1700 159.2804 172.0753 181.9480 200.6506 203.7897 210.6614 242.8393 256.0423 287.9395 303.9725 343.6127 361.7133 382.3812 404.2043 407.4171 413.4098 416.6546 460.4932 492.5222 495.3483 507.4656 579.0816 597.2956 615.0875 625.2259 688.2287 691.3787 706.7455 722.8185 767.6570 778.6467 784.1641 846.9945 863.9805 902.2647 925.4456 931.0082 956.3233 968.7670 976.3235 990.4509 997.7691 1004.6052 1012.1844 1027.3730 1033.8410 1051.4663 1063.9530 1076.6185 1078.3693 1085.7301 1119.6804 1142.6287 1144.8635 1173.6944 1179.7816 1183.2447 1193.4523 1246.5284 1276.8580 1285.5152 1309.4991 1314.4840 1335.6011 1350.0913 1376.5221 1380.4262 1392.6644 1413.3271 1424.9748 1433.7528 1438.3239 1440.7890 1447.2047 1455.4069 1467.3666 1476.4517 1481.6302 1486.7675 1499.6890 1559.5075 1599.2472 1600.9912 1614.3069 1628.3967 1660.0812 2934.9855 2942.6626 2988.6523 3030.1959 3032.0944 3033.5382 3068.4309 3074.1517 3078.8074 3089.9460 3106.0773 3114.6738 3123.3629 3132.2326 3139.8155 3150.6574 3159.6020 3171.9685 3200.0093
redmass: 3.7320 3.9511 3.9473 3.7707 4.3240 4.8141 3.4873 2.8606 4.1093 2.6662 3.2033 1.9393 1.4244 1.2491 1.0872 4.7808 3.3423 2.8859 4.2743 4.4208 3.3736 3.1560 3.7261 2.8241 4.0265 4.9319 3.0697 5.2516 3.1945 3.4461 4.2662 8.0085 6.1652 4.1429 3.5700 2.8591 1.6750 8.2195 7.5057 2.5370 3.6203 1.2469 3.7272 1.7438 1.5209 2.2802 1.3515 2.6322 1.3863 5.9329 1.3760 2.3325 1.2226 1.9284 1.6453 1.5276 5.1146 1.9970 1.6848 1.2302 3.3566 1.5034 2.9271 1.0542 1.1296 2.5315 3.5898 3.6218 2.3426 1.5195 1.3267 1.8546 2.1008 1.8810 1.5995 8.2894 2.5969 1.1335 1.1758 1.2108 2.1640 1.1380 1.1058 1.0448 1.0800 1.0517 2.4109 1.0502 1.0720 9.4922 6.6710 6.8430 6.5180 10.1466 4.6419 1.0399 1.0396 1.0367 1.0924 1.0939 1.0606 1.0968 1.1005 1.1004 1.0600 1.0986 1.0994 1.0984 1.0851 1.0886 1.0930 1.0974 1.1019 1.1149
irintensity: 0.0540 0.2221 0.4665 1.1446 0.1818 0.7905 0.6392 3.5594 1.0890 1.8976 3.0363 0.4902 0.1851 0.7387 0.4219 3.4700 1.2427 0.1974 8.1479 15.5640 2.0654 0.5568 8.3669 0.0515 11.2006 1.5142 2.8072 2.4710 11.3261 17.3423 3.0389 7.3568 1.2836 15.2673 3.3108 21.8045 61.8488 12.4672 17.9095 12.2867 11.3861 0.0507 2.7990 15.8994 5.3818 6.6158 73.2547 29.6241 0.1017 2.4443 0.9997 17.0832 29.8151 1.2118 15.4896 2.3236 13.0819 9.8460 8.5704 1.7641 37.1034 2.9446 65.6269 0.0022 1.2991 3.8328 8.8332 1.9786 80.7872 35.1687 0.5536 22.5392 51.1708 66.3256 33.5976 2.8523 152.4297 6.0256 16.2679 25.8154 5.1601 64.0855 2.9801 3.8312 42.1697 22.4837 58.2562 2.5655 41.1093 359.7961 53.7796 153.3125 58.4922 245.0532 6.4460 69.6997 90.7021 21.0128 42.7765 35.1298 12.2184 5.6508 20.3981 57.5575 6.5415 2.4116 2.6373 5.2902 0.8086 2.4812 22.0245 20.0395 13.9103 22.4315
temp: 298.150 k
press: 1.00000 atm
elementType: 8 8 7 7 7 6 6 6 6 6 6 6 6 6 6 6 6 6 6 6 6 1 1 1 1 1 1 1 1 1 1 1 1 1 1 1 1 1 1 1
symmnumber: 1
zpe: 843104.8 jmol-1
zpe.correction: 0.321122 hartree
zpe.thermalcorrener: 0.342087 hartree
zpe.thermalcorrenthalpy: 0.343031 hartree
zpe.thermalcorrgfe: 0.269688 hartree
zpe.sumelectzpe: -934.253175 hartree
zpe.sumelectthermal: -934.232209 hartree
zpe.sumelectthermalent: -934.231265 hartree
zpe.sumelectthermalfe: -934.304608 hartree
dipole: -3.2036 -2.8302 0.9568
dipole: 4.3805
quadrupole: -120.0721 -124.8639 -115.7964
quadrupole: 3.2136 1.1001 4.5661
quadrupole: 0.1720 -4.6198 4.4478 3.2136 1.1001 4.5661
hfenergy: -934.5742963 hartree
pointgroup: C01 [X(C16H19N3O2)]
dipole: 1.2725807 1.111591 0.3391745 debye
polarizability: 256.4060809|-9.4344474|193.8045228|-0.8053686|-11.3626799|149.539596 unknown
InChI: InChI=1S/C16H19N3O2/c1-5-11-18-15(20)14(17(3)4)12(2)19(16(18)21)13-9-7-6-8-10-13/h5-10H,1,11H2,2-4H3
charge 0 multiplicity 1
40 atoms
O  -3.412802 -0.026135 -0.399126
O  0.770084 -2.136853 -0.61343
N  0.683711 0.161048 -0.136027
N  -1.324975 -1.079777 -0.498454
N  -2.191726 2.537017 0.213828
C  -0.051368 1.344202 0.079467
C  -1.438439 1.329251 -0.004121
C  -2.148798 0.076857 -0.306866
C  0.080999 -1.097605 -0.427683
C  2.142616 0.165334 -0.069306
C  -2.010895 -2.381464 -0.766412
C  0.716188 2.59978 0.405556
C  -2.871552 3.061467 -0.997299
C  -3.067981 2.511977 1.412628
C  2.785958 -0.197963 1.133059
C  2.891424 0.527069 -1.209506
C  -2.448198 -3.060167 0.518676
C  4.196813 -0.187372 1.196906
C  4.302305 0.537548 -1.140396
C  4.956198 0.183411 0.062593
C  -1.949366 -4.242876 0.954012
H  -2.890624 -2.145567 -1.390194
H  -1.303808 -3.015082 -1.323429
H  1.358389 2.459835 1.293685
H  -0.01885 3.396953 0.592335
H  1.379708 2.897215 -0.42657
H  -2.143727 3.140312 -1.823893
H  -3.719396 2.422654 -1.327326
H  -3.255691 4.075578 -0.780473
H  -2.479614 2.197496 2.29245
H  -3.443576 3.535255 1.599364
H  -3.935424 1.827153 1.298532
H  2.186918 -0.498663 1.99893
H  2.373593 0.781573 -2.140483
H  -3.226551 -2.53622 1.090448
H  4.700962 -0.473266 2.126212
H  4.887792 0.813464 -2.023983
H  6.050447 0.188285 0.11332
H  -2.306654 -4.708764 1.879669
H  -1.165789 -4.773065 0.399307
