program: Gaussian 09
title: 000208425
version: EM64L-G09RevD.01
frameworkgroup: C1[X(C11H14N2O)]
method: RPBEPBE
basis: SDD
operation: Freq
keyword: #p
keyword: freq=noraman
keyword: PBEPBE/SDD
title: #p freq=noraman PBEPBE/SDD
converged: YES YES NO NO
title: Mulliken charges:
elementType: O N N C C C C C C C C C C C H H H H H H H H H H H H H H
charge: -0.292236 -0.166494 -0.452993 -0.226610 0.383857 0.271872 -0.332449 -0.671115 0.145314 -0.408880 -0.399962 -0.652266 -0.262380 -0.209827 0.225762 0.264923 0.200701 0.236204 0.225920 0.218157 0.324422 0.232129 0.229364 0.206107 0.238157 0.216115 0.228142 0.228067
chargesum: 0.00000
title: Mulliken charges with hydrogens summed into heavy atoms:
elementType: O N N C C C C C C C C C C C
charge: -0.292236 -0.166494 -0.128571 -0.000848 0.383857 0.271872 0.133175 0.009166 0.145314 -0.176751 -0.170598 0.008112 -0.034238 0.018240
polarizability: 1.75832557e+02 4.67022886e+00 1.38246281e+02 9.56169101e+00 1.58888174e+00 8.46116640e+01
1716.lowfreq: -13.3991 -7.1267 -0.0007 -0.0004 -0.0004 5.9178 42.6801 56.2733 99.5439
frequency: 42.6703 56.2537 99.5366 114.8645 147.1177 196.8388 223.0559 236.1803 281.0060 298.3686 348.0384 351.3156 388.4043 435.3428 474.6438 501.2695 552.7882 580.4350 586.7091 622.9009 685.6946 702.9651 711.9772 746.1874 757.7290 774.7092 788.8862 858.5350 873.1781 935.9951 946.6041 954.7537 974.3358 1015.1593 1033.2318 1065.5065 1077.8594 1091.7151 1113.9513 1163.1119 1172.7870 1200.1957 1213.7978 1251.3115 1262.9269 1284.8602 1301.8730 1315.7413 1355.8977 1372.6478 1380.8468 1386.3993 1409.7904 1432.6402 1459.9691 1465.5113 1468.9108 1471.5076 1475.7044 1480.2287 1498.6360 1606.3989 1621.7552 1637.9562 2982.6526 2983.2580 2988.0727 3004.1133 3064.3703 3082.1275 3082.5979 3093.2922 3097.8850 3118.8212 3125.0815 3144.1401 3166.1819 3563.4495
redmass: 2.6058 3.4359 4.1250 4.5893 3.7716 1.2193 1.4818 1.5742 3.4256 2.7037 3.6897 3.3905 5.3397 6.4617 3.2708 3.0099 3.9672 3.8934 1.8197 2.3874 4.0858 4.3095 6.7053 2.6159 1.4830 2.1182 1.4173 1.4342 3.3527 1.3998 2.7534 2.2392 1.3142 1.8223 2.0969 2.5763 1.9442 2.0040 1.7833 2.5576 1.0592 2.5915 1.9037 2.2343 1.6088 1.8099 1.3955 1.5441 1.3290 2.2815 1.2150 1.2148 3.1735 2.2628 1.4513 1.0877 1.0736 1.0604 1.5236 1.1074 2.9458 7.6148 6.9741 4.8865 1.0376 1.0353 1.0641 1.0846 1.0977 1.0996 1.0979 1.1009 1.1014 1.0878 1.0886 1.0931 1.1002 1.0771
irintensity: 0.2318 0.1250 2.9118 0.3175 0.2046 0.1485 0.7525 0.8067 0.2575 0.8637 15.9463 0.8275 7.4822 7.0938 4.3150 28.5779 1.2820 4.0002 30.7029 31.7871 6.1554 6.4131 29.6302 16.3593 94.2997 2.1035 9.9560 2.4564 2.5940 3.8034 2.5860 13.1132 0.1105 8.8057 6.2232 5.1127 9.2786 12.3310 7.1240 4.8753 0.8024 12.1135 52.5589 59.4498 11.5449 206.4698 21.9385 3.9947 6.1526 11.5991 15.5591 23.1916 19.5341 200.8294 2.4228 5.6764 34.7124 8.7000 50.3657 52.1344 43.2576 59.1483 15.7019 452.3616 12.1016 25.4411 48.3786 23.3622 8.8363 62.7393 14.9996 16.8155 31.2917 11.1436 4.9370 23.2851 24.5111 41.9082
temp: 298.150 k
press: 1.00000 atm
elementType: 8 7 7 6 6 6 6 6 6 6 6 6 6 6 1 1 1 1 1 1 1 1 1 1 1 1 1 1
symmnumber: 1
zpe: 609103.6 jmol-1
zpe.correction: 0.231995 hartree
zpe.thermalcorrener: 0.244905 hartree
zpe.thermalcorrenthalpy: 0.245849 hartree
zpe.thermalcorrgfe: 0.192553 hartree
zpe.sumelectzpe: -611.297458 hartree
zpe.sumelectthermal: -611.284548 hartree
zpe.sumelectthermalent: -611.283603 hartree
zpe.sumelectthermalfe: -611.336900 hartree
dipole: -1.9842 -2.8908 0.2046
dipole: 3.5122
quadrupole: -81.5644 -80.4000 -85.9956
quadrupole: -11.9100 0.6665 -0.2200
quadrupole: 1.0890 2.2533 -3.3423 -11.9100 0.6665 -0.2200
hfenergy: -611.5294529 hartree
pointgroup: C01 [X(C11H14N2O1)]
dipole: 0.8300994 1.1041064 -0.036194 debye
polarizability: 176.4367695|1.9822138|136.9195697|-8.5866006|-7.2677252|85.3341624 unknown
InChI: InChI=1S/C11H14N2O/c1-3-13-8(2)9-6-4-5-7-10(9)12-11(13)14/h4-8,12H,3H2,1-2H3
charge 0 multiplicity 1
28 atoms
O  -2.372653 -2.031396 0.33549
N  -1.589379 0.170865 0.040264
N  -0.089048 -1.59317 0.511665
C  -0.51535 1.165228 0.318397
C  0.85099 0.580218 -0.013969
C  1.0369 -0.816665 0.16572
C  -2.938689 0.671846 -0.298985
C  -0.567925 1.643483 1.798604
C  -1.426375 -1.183844 0.303665
C  1.946755 1.375378 -0.405775
C  2.316766 -1.398103 -0.013542
C  -3.081106 1.024521 -1.794783
C  3.227715 0.804753 -0.590728
C  3.407735 -0.583334 -0.382909
H  -0.707152 2.034795 -0.338884
H  -3.653947 -0.122193 -0.025621
H  -3.158792 1.557264 0.329316
H  -0.353007 0.801933 2.480383
H  0.18417 2.433165 1.97484
H  -1.565715 2.048898 2.046919
H  0.014814 -2.595298 0.677548
H  1.801807 2.452568 -0.556103
H  2.453598 -2.477392 0.124421
H  -2.34973 1.793219 -2.106408
H  -2.923382 0.127002 -2.417025
H  -4.094485 1.416606 -1.999698
H  4.073231 1.432578 -0.889683
H  4.396454 -1.035025 -0.519618
