program: Gaussian 09
title: 000208373
version: EM64L-G09RevD.01
frameworkgroup: C1[X(C16H33NO2)]
method: RPBEPBE
basis: SDD
operation: Freq
keyword: #p
keyword: freq=noraman
keyword: PBEPBE/SDD
title: #p freq=noraman PBEPBE/SDD
converged: YES YES NO NO
title: Mulliken charges:
elementType: O O N C C C C C C C C C C C C C C C C H H H H H H H H H H H H H H H H H H H H H H H H H H H H H H H H H
charge: -0.277859 -0.241625 -0.086536 0.302990 -0.412751 0.168008 -0.726858 -0.729784 -0.729051 -0.724017 -0.723716 0.206442 -0.310760 -0.375910 -0.346790 -0.298067 -0.384602 -0.712221 -0.693854 0.219791 0.186178 0.217585 0.222922 0.203020 0.204712 0.205861 0.235279 0.210799 0.210104 0.213199 0.222825 0.218361 0.235961 0.207499 0.221532 0.226767 0.220270 0.223763 0.210547 0.215372 0.205482 0.223979 0.181550 0.199816 0.219024 0.213231 0.227556 0.216081 0.211441 0.234555 0.218238 0.213661
chargesum: 0.00000
title: Mulliken charges with hydrogens summed into heavy atoms:
elementType: O O N C C C C C C C C C C C C C C C C
charge: -0.277859 -0.241625 -0.086536 0.302990 -0.006782 0.168008 -0.083331 -0.083931 -0.094950 -0.046870 -0.067918 0.206442 0.133274 0.050009 0.082671 0.083299 0.047654 -0.057144 -0.027401
polarizability: 2.07250623e+02 -1.36841170e+00 1.83544353e+02 1.64031446e+00 -1.19514943e+00 1.72213633e+02
1716.lowfreq: -10.4779 -5.2004 -0.0006 -0.0005 0.0003 6.1331 15.9336 18.7829 30.1115
frequency: 15.0384 18.6718 30.0359 52.4393 55.1495 62.8709 72.1267 82.6611 106.0333 122.5231 148.0630 169.3314 174.6131 212.9517 214.2925 219.2861 236.3036 239.3219 244.8114 267.9233 268.4590 271.7912 277.5210 287.4015 289.8150 297.8748 317.7620 334.8689 355.6645 368.7491 392.1352 396.3844 411.4088 428.8238 477.0868 489.5513 509.3288 533.7248 588.0638 713.4436 730.7391 739.0321 747.2526 763.8589 768.1383 803.7948 818.5508 859.6082 879.6477 880.9020 907.0489 913.4512 925.8711 928.9372 941.1513 944.1191 976.3809 979.7849 1006.6494 1019.1302 1024.0932 1032.0434 1042.1510 1064.9889 1072.8906 1082.3150 1088.1350 1099.1063 1117.0138 1132.3786 1147.4245 1164.3720 1198.7877 1202.5687 1227.9673 1232.5867 1249.4553 1251.7725 1254.3835 1274.1620 1293.5446 1319.5125 1328.2541 1332.5597 1339.1174 1345.9493 1362.9058 1366.6321 1371.2019 1373.0816 1374.9671 1375.7279 1382.9761 1384.9715 1397.1807 1401.3963 1445.0156 1449.4356 1452.7198 1456.1686 1456.6913 1461.1576 1464.5614 1466.4602 1468.1495 1470.2817 1471.0168 1475.2305 1475.8915 1479.5660 1480.6391 1486.0378 1489.5440 1495.6820 1497.6637 1499.5168 1617.0047 2849.7676 2916.2104 2963.1689 2964.8828 2969.5079 2975.1336 2977.1971 2978.6639 2982.4503 2988.9185 2989.4606 2994.5586 3014.9755 3015.8715 3021.2298 3033.4231 3039.2815 3053.8471 3055.3395 3059.3865 3062.7515 3066.7988 3071.4346 3075.1985 3076.0266 3076.9666 3081.1852 3086.6591 3088.6060 3092.2851 3093.4631 3095.0227 3103.1091
redmass: 3.2113 3.1712 3.5918 3.2276 3.8481 2.6581 4.3646 2.9768 3.1410 2.5086 2.0650 2.0732 1.8406 1.8768 1.1281 1.4313 2.0007 1.1120 1.5508 1.6160 1.6029 1.3890 1.4955 1.8248 1.7280 1.8755 2.8644 3.0330 2.1971 2.4515 2.5287 2.5528 1.8959 2.5562 2.6950 2.7616 2.7483 2.4460 3.4880 5.7609 3.1529 3.5330 2.4524 1.9687 1.1617 1.1579 2.4978 2.3476 2.1013 2.1468 1.9599 2.0545 1.7735 1.5509 1.2381 1.5008 2.5365 1.7109 1.3461 2.2121 1.4690 1.4328 2.3563 2.1362 2.1161 2.9264 2.3010 2.6020 1.7252 2.5155 1.6679 1.7141 2.1271 2.6354 3.3221 1.6535 1.3076 2.7751 3.1541 1.1492 1.1582 1.2661 1.4703 1.3493 1.2340 1.3203 1.2699 1.3226 1.2038 1.2495 1.1985 1.2049 1.3407 1.2749 1.2162 1.2030 1.0787 1.0719 1.1019 1.0678 1.0556 1.0518 1.0596 1.0520 1.0574 1.0533 1.0572 1.0502 1.0512 1.0558 1.0592 1.0635 1.0637 1.0630 1.0732 1.0571 9.3370 1.0717 1.0675 1.0417 1.0528 1.0359 1.0390 1.0349 1.0345 1.0369 1.0606 1.0601 1.0361 1.0703 1.0801 1.0871 1.0981 1.1005 1.0996 1.0994 1.0992 1.0992 1.0986 1.0990 1.1004 1.0990 1.0990 1.1008 1.1004 1.1000 1.1075 1.1005 1.0973 1.0982
irintensity: 0.1941 0.1267 0.1915 0.6783 0.8781 0.0341 0.1969 0.1978 0.9425 1.1702 0.5777 1.3442 0.8338 0.6518 0.0788 0.9592 2.0724 0.4060 0.6785 1.1411 0.5644 0.1077 0.2639 1.0138 0.3018 1.1538 1.6177 12.9019 0.4216 0.5008 2.2631 3.4865 0.5092 3.4942 2.7202 3.4181 1.4182 7.7966 2.5191 4.7917 8.8030 1.4117 1.3882 9.4684 4.0952 5.7044 16.4134 1.2416 2.9671 4.8146 4.1208 7.0894 4.8574 0.5226 0.9821 1.8593 12.0168 8.3071 5.9840 20.9843 9.8852 3.3841 10.7897 24.0766 56.7230 203.2480 31.0211 35.7390 17.7811 16.0489 48.4692 23.1691 17.7433 1.0315 13.6109 19.1197 5.0545 4.0429 10.6727 6.7011 12.0247 3.9465 5.1040 3.7931 12.9021 6.6610 2.1862 8.5169 10.6727 11.1946 20.4506 31.8642 13.5433 20.1346 24.6989 11.8075 3.0286 0.9313 16.6390 11.2634 5.2249 1.7756 11.4909 6.7709 3.0492 8.0001 3.3983 11.9762 4.0950 13.6504 18.3085 7.1364 2.8983 22.0144 6.1781 20.1516 139.2666 99.0267 76.0137 17.8951 54.5722 49.0310 21.5610 25.8887 28.2125 27.2049 56.2954 15.8482 24.1699 20.5128 32.5339 8.8253 11.5026 15.3073 67.6163 8.2159 20.3071 38.4545 80.9232 57.5442 17.5186 47.3440 44.0749 54.9220 37.7330 61.3005 19.7754 22.7967 25.0693 28.9210
temp: 298.150 k
press: 1.00000 atm
elementType: 8 8 7 6 6 6 6 6 6 6 6 6 6 6 6 6 6 6 6 1 1 1 1 1 1 1 1 1 1 1 1 1 1 1 1 1 1 1 1 1 1 1 1 1 1 1 1 1 1 1 1 1
symmnumber: 1
zpe: 1220000.4 jmol-1
zpe.correction: 0.464674 hartree
zpe.thermalcorrener: 0.489505 hartree
zpe.thermalcorrenthalpy: 0.490449 hartree
zpe.thermalcorrgfe: 0.409076 hartree
zpe.sumelectzpe: -833.097329 hartree
zpe.sumelectthermal: -833.072498 hartree
zpe.sumelectthermalent: -833.071554 hartree
zpe.sumelectthermalfe: -833.152927 hartree
dipole: 0.5105 0.6017 -1.0635
dipole: 1.3242
quadrupole: -116.6356 -119.5624 -124.0878
quadrupole: -0.3336 -2.5565 4.2370
quadrupole: 3.4597 0.5328 -3.9925 -0.3336 -2.5565 4.2370
hfenergy: -833.5620027 hartree
pointgroup: C01[X(C16H33N1O2)]
dipole: 0.0816128 -0.0064997 0.5145173 debye
polarizability: 205.4682248|5.1661586|181.1026857|6.1430341|-4.2650333|176.4376987 unknown
InChI: InChI=1S/C16H33NO2/c1-8-17(9-2)11-10-12-19-14(18)16(6,7)13-15(3,4)5/h8-13H2,1-7H3
charge 0 multiplicity 1
52 atoms
O  0.490924 1.830323 0.576619
O  0.99313 1.286507 -1.631588
N  -3.436559 -0.196719 -0.689051
C  2.06886 -1.420423 1.505723
C  2.580999 0.062331 1.476106
C  2.693536 0.882801 0.144437
C  0.784868 -1.617568 0.660302
C  3.159335 -2.428929 1.046911
C  1.733246 -1.735834 2.993322
C  3.419235 2.225021 0.504535
C  3.495346 0.179627 -0.97673
C  1.321636 1.305619 -0.421467
C  -0.771517 2.517388 0.150323
C  -2.006067 1.617548 0.302026
C  -2.190283 0.59908 -0.845904
C  -3.291838 -1.287504 0.309559
C  -4.032581 -0.615128 -1.98561
C  -4.627307 -1.954287 0.687871
C  -3.220038 -1.640253 -2.825289
H  1.933167 0.654259 2.150713
H  3.593923 0.067453 1.931006
H  0.96785 -1.44741 -0.416602
H  -0.012436 -0.925328 0.986263
H  0.405884 -2.651362 0.774196
H  4.086863 -2.302734 1.63799
H  2.803784 -3.46659 1.195927
H  3.416625 -2.315065 -0.018687
H  2.612876 -1.567065 3.643972
H  1.422328 -2.791247 3.110458
H  0.910746 -1.093235 3.360253
H  3.453264 2.904513 -0.366858
H  4.459409 2.008145 0.809869
H  2.907473 2.741785 1.334529
H  4.469483 -0.162563 -0.583869
H  2.95499 -0.687602 -1.389755
H  3.676251 0.876507 -1.813294
H  -0.829937 3.381089 0.833564
H  -0.646156 2.862513 -0.892445
H  -1.952677 1.109648 1.283877
H  -2.905616 2.263717 0.331314
H  -2.258934 1.160135 -1.797264
H  -1.284282 -0.044009 -0.931759
H  -2.56595 -2.070767 -0.029915
H  -2.855218 -0.841753 1.222992
H  -5.040338 -1.023935 -1.785981
H  -4.185565 0.302887 -2.585195
H  -5.363448 -1.188786 0.991899
H  -5.056743 -2.534152 -0.148927
H  -4.477217 -2.652294 1.531981
H  -2.214324 -1.252858 -3.070175
H  -3.096992 -2.600367 -2.291196
H  -3.743403 -1.850227 -3.776879
