program: Gaussian 09
title: 000208371
version: EM64L-G09RevD.01
frameworkgroup: C1[X(C17H33NO2)]
method: RPBEPBE
basis: SDD
operation: Freq
keyword: #p
keyword: freq=noraman
keyword: PBEPBE/SDD
title: #p freq=noraman PBEPBE/SDD
converged: YES YES NO NO
title: Mulliken charges:
elementType: O O N C C C C C C C C C C C C C C C C C H H H H H H H H H H H H H H H H H H H H H H H H H H H H H H H H H
charge: -0.274137 -0.239871 -0.068029 0.300381 0.164712 -0.415407 -0.353472 -0.365170 -0.399682 -0.391851 -0.398002 -0.339789 -0.737645 -0.728162 -0.726255 -0.725667 -0.723813 0.211435 -0.387757 -0.313437 0.188152 0.220317 0.167699 0.213557 0.209646 0.167182 0.204148 0.192886 0.191137 0.204223 0.189046 0.213312 0.179852 0.197348 0.230995 0.224343 0.206425 0.204421 0.206005 0.235062 0.210383 0.214175 0.210063 0.223006 0.208164 0.225342 0.238683 0.219904 0.215566 0.217111 0.240423 0.223732 0.219308
chargesum: 0.00000
title: Mulliken charges with hydrogens summed into heavy atoms:
elementType: O O N C C C C C C C C C C C C C C C C C
charge: -0.274137 -0.239871 -0.068029 0.300381 0.164712 -0.006937 0.027784 0.011658 -0.002647 0.003510 0.004356 0.037412 -0.075882 -0.082674 -0.091634 -0.069155 -0.049660 0.211435 0.069777 0.129602
polarizability: 2.28864987e+02 -1.99324982e+00 1.88050317e+02 4.13238946e+00 3.14432708e+00 1.70624957e+02
1716.lowfreq: -0.0005 0.0005 0.0006 4.4084 7.8480 14.2762 20.2297 25.8038 27.6031
frequency: 19.9285 25.7836 27.5831 52.8809 54.8511 70.9484 95.1871 102.6581 115.9399 158.8362 167.9101 181.9837 206.8611 217.3701 221.2140 234.2001 237.9290 249.6041 270.8492 275.8633 282.4365 288.6043 302.2395 305.0311 329.9987 344.9852 358.8307 369.4599 387.2157 401.9303 410.1750 440.7142 448.4063 472.6592 499.0350 527.5315 566.1632 589.3131 719.7442 735.7156 747.4725 753.7690 778.2378 804.9013 827.4874 852.2959 856.0509 874.4667 878.7169 902.2779 911.8198 923.4860 926.0525 934.5128 938.5574 949.1239 959.3182 978.0683 993.9159 1007.6051 1022.8384 1032.2497 1041.7055 1054.1111 1061.5237 1077.3067 1091.8186 1106.6852 1123.0053 1136.0001 1137.6761 1151.3378 1152.9989 1158.4126 1197.8633 1202.5820 1226.8567 1229.3306 1251.6179 1254.2828 1261.3453 1266.6632 1280.6672 1287.4863 1294.3051 1306.6082 1331.3410 1331.6043 1342.5332 1345.9213 1346.3982 1352.1334 1368.5104 1370.5738 1375.1389 1377.6263 1380.1661 1396.4493 1396.7126 1402.5659 1448.8178 1451.9635 1453.8748 1457.5549 1460.2170 1460.8172 1461.5496 1467.1813 1467.6634 1469.5620 1470.8632 1471.9770 1475.1682 1477.4121 1481.9201 1487.0198 1489.7551 1496.8557 1499.7425 1619.9160 2815.1029 2820.1195 2837.6889 2963.3239 2965.1378 2967.9103 2971.0855 2976.8619 2979.8509 2986.2559 2986.7803 2993.5697 2993.8017 3006.6136 3016.3983 3019.2993 3032.1033 3033.5512 3044.2279 3047.0935 3054.6120 3055.8042 3060.7150 3062.7368 3067.8160 3069.0100 3074.1926 3078.9309 3085.3304 3096.4202 3096.9505 3098.7824 3105.3256
redmass: 3.1007 3.7770 3.5492 4.6366 2.9460 3.4500 4.2755 2.1882 3.1983 3.2611 2.2054 2.4482 1.7166 1.7386 1.0524 1.9804 1.9267 1.4824 1.4802 1.7996 1.5094 1.6764 2.0430 1.7156 3.1165 3.3275 2.2911 2.3899 1.7968 2.7130 1.9247 2.7941 2.9650 2.9728 2.7019 3.0620 2.1659 3.1523 5.2019 4.0130 2.8278 3.3947 1.3171 1.4661 2.4744 1.8860 1.8609 1.9167 1.5042 2.6070 2.1330 1.7960 1.7073 1.8833 1.2332 2.0202 1.3088 1.7276 2.5625 1.3419 1.4241 1.4226 2.4720 2.3289 2.5636 2.3512 3.0120 1.9436 2.5073 1.8513 2.3878 1.6692 1.4145 2.1644 1.4683 2.3113 2.8955 1.6472 3.1812 3.4250 1.2636 1.1714 1.3389 1.2462 1.1346 1.3299 1.4694 1.3001 1.3930 1.3194 1.4541 1.4605 1.2010 1.3208 1.2152 1.2065 1.3237 1.3186 1.3097 1.2030 1.0720 1.0898 1.0978 1.0538 1.0795 1.0536 1.0878 1.0882 1.0559 1.0524 1.0534 1.0817 1.0510 1.0939 1.0572 1.0953 1.0641 1.0635 1.0566 9.4182 1.0713 1.0710 1.0694 1.0408 1.0537 1.0621 1.0365 1.0385 1.0349 1.0626 1.0606 1.0362 1.0864 1.0596 1.0593 1.0853 1.0986 1.0959 1.0897 1.1011 1.0993 1.1034 1.0993 1.0993 1.1028 1.0986 1.1002 1.0992 1.0999 1.1002 1.1080 1.0965 1.0979
irintensity: 0.1727 0.2747 0.4192 0.6792 0.1113 0.1249 0.6164 0.3156 0.8931 1.0657 0.2157 0.2924 0.0230 0.6930 0.0936 0.0833 0.9355 0.7354 1.3151 1.3070 0.4884 2.7325 2.8180 0.7647 7.4855 8.9711 0.6843 0.2544 2.9531 2.3301 0.9598 3.2781 0.7290 5.8843 0.0358 6.1433 0.9410 1.8242 4.2994 2.1555 1.5880 11.8056 1.0446 0.1331 9.0736 3.2709 6.4440 2.8351 1.3662 9.3549 4.7062 5.6316 5.8337 14.1404 0.5928 14.6950 2.4382 9.4808 9.3312 12.1780 5.6535 2.1047 7.0435 2.8453 3.1224 187.2988 168.2432 10.3710 6.5317 5.3032 39.7958 58.3682 1.2299 14.0661 11.8179 2.3135 11.6542 11.4146 10.8266 3.4782 4.5760 7.2698 4.6604 3.0506 2.3757 10.6992 8.9631 3.1956 1.2446 6.2504 16.2974 1.5983 10.7938 2.4239 14.5269 24.4855 16.0721 18.4291 9.0024 10.9103 1.2812 6.3310 7.5154 4.9070 2.4259 1.8475 13.6501 8.0714 6.6403 5.6332 4.7975 0.8004 13.2958 3.1741 14.1537 17.0516 2.8094 28.7370 22.2677 132.1107 45.2980 43.3353 212.6288 17.3745 49.2091 39.4135 49.6140 20.7616 26.7203 30.9007 37.6117 26.9877 16.4838 1.4671 38.9410 90.4112 13.8994 67.4731 44.6418 5.9575 9.1621 102.1230 38.3426 21.4299 10.0352 84.4684 19.0078 31.2707 61.2230 14.6167 32.2309 36.9050 27.8362
temp: 298.150 k
press: 1.00000 atm
elementType: 8 8 7 6 6 6 6 6 6 6 6 6 6 6 6 6 6 6 6 6 1 1 1 1 1 1 1 1 1 1 1 1 1 1 1 1 1 1 1 1 1 1 1 1 1 1 1 1 1 1 1 1 1
symmnumber: 1
zpe: 1244863.3 jmol-1
zpe.correction: 0.474143 hartree
zpe.thermalcorrener: 0.497878 hartree
zpe.thermalcorrenthalpy: 0.498823 hartree
zpe.thermalcorrgfe: 0.420275 hartree
zpe.sumelectzpe: -871.152536 hartree
zpe.sumelectthermal: -871.128801 hartree
zpe.sumelectthermalent: -871.127857 hartree
zpe.sumelectthermalfe: -871.206405 hartree
dipole: -0.5303 -0.1721 -1.1633
dipole: 1.2900
quadrupole: -115.6552 -123.8878 -131.8437
quadrupole: 2.4105 -3.1366 4.5804
quadrupole: 8.1404 -0.0923 -8.0481 2.4105 -3.1366 4.5804
hfenergy: -871.6266795 hartree
pointgroup: C01 [X(C17H33N1O2)]
dipole: 0.2470181 -0.0778247 0.4364747 debye
polarizability: 229.026073|2.8559755|188.4008594|-0.4610912|-2.62145|170.1133284 unknown
InChI: InChI=1S/C17H33NO2/c1-16(2,3)14-17(4,5)15(19)20-13-9-12-18-10-7-6-8-11-18/h6-14H2,1-5H3
charge 0 multiplicity 1
53 atoms
O  -1.163505 -1.499006 0.770934
O  -1.562099 -1.456166 -1.520433
N  3.612803 -0.154797 0.010376
C  -3.1511 1.729794 0.661837
C  -3.423819 -0.941563 0.061452
C  -3.472104 0.252018 1.080664
C  3.463478 0.721081 -1.18209
C  5.003721 -0.670376 0.122546
C  4.434425 1.918104 -1.119176
C  6.0207 0.484318 0.230821
C  5.895323 1.435878 -0.979872
C  2.623051 -1.260059 0.03981
C  -1.855645 1.839391 -0.183683
C  -4.331229 2.395154 -0.100847
C  -2.942715 2.519793 1.987488
C  -4.263258 -0.724375 -1.219639
C  -3.981497 -2.19638 0.813239
C  -1.980036 -1.293299 -0.349551
C  1.176822 -0.7707 0.274731
C  0.23195 -1.957741 0.505218
H  -4.495067 0.249428 1.513095
H  -2.784632 -0.019271 1.905233
H  3.653099 0.141663 -2.126245
H  2.424057 1.090634 -1.227678
H  5.062353 -1.313803 1.021017
H  5.270751 -1.308658 -0.763043
H  4.1678 2.545252 -0.246548
H  4.310544 2.537002 -2.028702
H  7.044092 0.067282 0.298627
H  5.822273 1.045182 1.164584
H  6.195993 0.898537 -1.903426
H  6.580777 2.297475 -0.869746
H  2.659009 -1.873402 -0.899984
H  2.910396 -1.933754 0.872258
H  -0.997302 1.388154 0.346752
H  -1.955455 1.340489 -1.164581
H  -1.614411 2.902509 -0.374131
H  -5.267753 2.328169 0.485737
H  -4.116528 3.467882 -0.269924
H  -4.511621 1.932751 -1.084879
H  -2.771851 3.593155 1.780952
H  -2.068993 2.135062 2.546515
H  -3.830195 2.43746 2.644118
H  -4.327319 -1.661628 -1.800126
H  -5.286598 -0.407866 -0.94955
H  -3.81836 0.034312 -1.883082
H  -3.440716 -2.366243 1.759591
H  -3.891137 -3.10501 0.189963
H  -5.052733 -2.041641 1.038538
H  1.169455 -0.102621 1.155653
H  0.81223 -0.19645 -0.595205
H  0.219994 -2.630435 -0.372348
H  0.49898 -2.521683 1.415137
