program: Gaussian 09
title: 000208345
version: EM64L-G09RevD.01
frameworkgroup: C1[X(C17H27NO)]
method: RPBEPBE
basis: SDD
operation: Freq
keyword: #p
keyword: freq=noraman
keyword: PBEPBE/SDD
title: #p freq=noraman PBEPBE/SDD
converged: YES YES NO NO
title: Mulliken charges:
elementType: O N C C C C C C C C C C C C C C C C C H H H H H H H H H H H H H H H H H H H H H H H H H H H
charge: -0.271387 -0.285049 0.196478 -0.490848 -0.109548 0.342631 -0.622733 0.309414 -0.741779 -0.744337 -0.552484 -0.413894 -0.370583 0.298100 -0.398111 -0.366409 -0.342620 -0.690712 -0.536043 0.209712 0.191482 0.225462 0.243053 0.206318 0.213455 0.209658 0.223840 0.223992 0.210197 0.226030 0.227291 0.252014 0.231951 0.203174 0.169287 0.174323 0.212028 0.239867 0.192819 0.190587 0.214868 0.211675 0.208397 0.218248 0.218232 0.241953
chargesum: 0.00000
title: Mulliken charges with hydrogens summed into heavy atoms:
elementType: O N C C C C C C C C C C C C C C C C C
charge: -0.271387 -0.057757 0.196478 -0.089654 0.115914 0.342631 -0.173362 0.309414 -0.094825 -0.084119 -0.300469 -0.181943 0.001878 0.298100 -0.158245 0.019942 0.040786 -0.055771 0.142391
polarizability: 2.70827417e+02 6.33482466e+00 1.85063490e+02 -6.92276015e+00 3.12372637e+00 1.34298749e+02
1716.lowfreq: -11.8406 -4.0495 -0.0008 -0.0006 0.0010 7.0987 18.9045 30.4842 42.2411
frequency: 18.5234 30.3699 42.2025 60.8612 76.3057 102.8839 106.9545 121.4722 137.0385 152.8658 161.8052 206.7312 208.6001 218.2379 228.3171 232.4248 250.3857 266.0676 300.9967 304.1189 322.4981 351.6294 379.3996 391.1872 411.3422 420.4742 467.8816 488.4060 500.3108 528.9520 541.0626 591.2553 622.6083 656.7003 690.9925 732.5502 736.7769 763.3219 800.4445 801.0717 823.3172 876.6594 884.6967 892.1441 895.6866 904.6780 927.9305 931.8940 937.3479 956.1972 994.3142 1004.8918 1013.6500 1032.0295 1040.3127 1071.5088 1076.9601 1108.4151 1109.3102 1111.9474 1124.7911 1133.3700 1140.0067 1145.3214 1164.1960 1183.9698 1195.2080 1207.3540 1215.1323 1225.8448 1233.6540 1252.1919 1270.2798 1276.2660 1282.9207 1285.5187 1295.2690 1307.2644 1333.3795 1338.8521 1356.9299 1372.9567 1375.7515 1383.1456 1388.7000 1393.3815 1415.6909 1435.3481 1449.5318 1451.1957 1459.4904 1463.6045 1464.2413 1466.3721 1471.2553 1472.9380 1473.3642 1476.5977 1481.2825 1485.0454 1486.1307 1493.6395 1493.7349 1575.9864 1623.7452 2854.5073 2935.1308 2953.6876 2953.9851 2957.1551 2966.8278 2971.7625 2972.5590 2975.3542 2988.2323 2992.2111 3007.0921 3024.4318 3036.7976 3039.1343 3040.3466 3064.7675 3069.5080 3070.0909 3072.0015 3077.9410 3082.1137 3114.1005 3120.0491 3148.1673 3159.4623 3409.9554
redmass: 4.0805 1.8899 2.9380 3.1300 3.0611 2.3531 2.2499 2.4412 3.1649 2.9766 3.2254 1.5364 2.0838 2.1646 1.1233 1.3416 1.0736 2.7898 2.8970 2.8403 3.2402 3.1696 2.5181 3.8641 3.4387 2.5873 2.6596 2.9330 4.0151 4.0145 2.5676 3.7803 3.9029 1.4413 5.7204 3.0815 1.0732 3.7705 1.4100 1.1580 2.9422 1.7612 3.0582 1.6060 1.8734 2.2151 1.5115 1.2145 1.3489 1.9382 1.5082 3.8842 2.7450 2.0567 2.4372 2.1416 2.3449 1.6419 2.6537 1.2605 2.2074 2.3882 1.7363 1.4852 1.3562 2.3009 1.9784 1.7232 2.1010 2.7869 1.7723 1.3396 1.6102 1.3221 1.0802 1.4386 1.5292 1.3787 1.4617 1.4579 1.5354 1.3600 2.4364 1.6804 1.2658 1.2247 3.2063 1.1998 1.1019 1.2166 1.0894 1.0637 1.0506 1.0690 1.0698 1.0659 1.0713 1.0431 1.0796 1.0697 1.1211 1.1541 2.0180 7.2333 6.8040 1.0702 1.0683 1.0403 1.0549 1.0634 1.0610 1.0352 1.0362 1.0360 1.0826 1.0831 1.0982 1.0979 1.0934 1.1037 1.1014 1.0992 1.1006 1.0984 1.0995 1.1000 1.0989 1.0890 1.0989 1.0903 1.0940 1.0736
irintensity: 0.0395 0.3148 0.2200 0.2477 6.6132 0.1649 0.6799 0.3629 1.3494 1.6992 0.5653 0.1438 1.2668 0.0437 0.0540 0.1291 0.0286 2.8749 0.3521 0.2765 0.6240 4.4305 0.6412 3.2636 3.6310 0.1015 8.4109 8.0054 1.2208 5.7251 4.4849 18.3878 1.6878 76.5502 7.0309 2.8440 9.8676 6.6677 35.0530 0.5582 2.8591 6.4704 1.5808 17.2218 8.2838 4.9358 1.0626 4.2007 1.0591 2.7836 4.6393 70.5979 19.3560 0.0894 7.5978 16.2556 0.8396 19.9721 3.1749 0.2156 3.6370 41.6059 49.4239 3.0081 4.8326 12.0527 38.3349 3.5871 12.4051 25.8483 75.1773 1.5780 42.0845 20.6239 1.7913 6.9107 17.8114 4.3331 1.9573 1.9520 15.5547 13.6894 6.5392 10.4686 6.6482 11.8525 32.8693 4.9023 4.0749 36.5970 9.6837 0.0905 12.4071 1.5544 8.1012 0.7922 41.1230 12.6086 10.7720 10.5180 4.5245 8.5212 113.2509 24.8241 67.0161 81.7533 29.6650 92.8888 14.7625 7.0909 56.4223 26.5409 41.7327 38.8498 6.1813 60.9671 2.7809 43.3354 19.1051 52.5161 50.0716 9.0057 81.1813 85.5882 57.9700 18.7885 49.9402 23.2932 22.4381 7.6047 17.8977 1.9558
temp: 298.150 k
press: 1.00000 atm
elementType: 8 7 6 6 6 6 6 6 6 6 6 6 6 6 6 6 6 6 6 1 1 1 1 1 1 1 1 1 1 1 1 1 1 1 1 1 1 1 1 1 1 1 1 1 1 1
symmnumber: 1
zpe: 1059282.1 jmol-1
zpe.correction: 0.403459 hartree
zpe.thermalcorrener: 0.424428 hartree
zpe.thermalcorrenthalpy: 0.425372 hartree
zpe.thermalcorrgfe: 0.352950 hartree
zpe.sumelectzpe: -792.485963 hartree
zpe.sumelectthermal: -792.464995 hartree
zpe.sumelectthermalent: -792.464051 hartree
zpe.sumelectthermalfe: -792.536472 hartree
dipole: -0.1651 -0.3589 -0.3795
dipole: 0.5478
quadrupole: -104.7558 -114.9070 -117.9769
quadrupole: 11.4830 -2.4094 0.3142
quadrupole: 7.7908 -2.3605 -5.4303 11.4830 -2.4094 0.3142
hfenergy: -792.8894223 hartree
pointgroup: C01 [X(C17H27N1O1)]
dipole: -0.0571857 -0.0866788 -0.1888472 debye
polarizability: 270.1116174|11.8443513|178.4611666|-2.438263|18.3205348|141.6168733 unknown
InChI: InChI=1S/C17H27NO/c1-5-6-9-18-14-10-13-7-8-15(19-4)11-16(13)17(2,3)12-14/h7-8,11,14,18H,5-6,9-10,12H2,1-4H3
charge 0 multiplicity 1
46 atoms
O  -5.263372 -0.218833 0.242121
N  2.662713 -0.550069 -0.530724
C  -0.621957 1.441291 0.346792
C  0.790386 1.167459 -0.252641
C  1.268482 -0.299874 -0.092755
C  -1.60378 0.30551 -0.026742
C  0.31207 -1.207335 -0.887655
C  -1.156285 -0.935035 -0.579029
C  -1.116677 2.810503 -0.202116
C  -0.523139 1.535234 1.901216
C  -2.984135 0.477884 0.228261
C  -2.112752 -1.940337 -0.855575
C  3.738482 0.025127 0.305262
C  -3.924246 -0.535425 -0.060633
C  -3.491425 -1.765374 -0.611587
C  5.125282 -0.439527 -0.18398
C  6.285911 0.134564 0.659956
C  7.672659 -0.32419 0.159308
C  -6.272083 -1.241057 -0.035876
H  1.512142 1.861295 0.221528
H  0.776125 1.402914 -1.338687
H  1.219407 -0.579975 0.978857
H  0.560626 -2.266374 -0.691162
H  0.502628 -1.040504 -1.971339
H  -2.063338 3.128942 0.269355
H  -0.361948 3.593256 0.003991
H  -1.278284 2.76391 -1.294446
H  -0.13632 0.598935 2.341976
H  0.152326 2.362203 2.1927
H  -1.51539 1.727323 2.347734
H  2.788378 -0.312254 -1.526362
H  -3.366477 1.408625 0.65974
H  -1.766727 -2.894046 -1.273955
H  3.580422 -0.326592 1.344971
H  3.729952 1.144063 0.344363
H  5.262067 -0.134418 -1.243806
H  5.153166 -1.546357 -0.169124
H  -4.193834 -2.572092 -0.841302
H  6.153938 -0.172276 1.717661
H  6.236168 1.242819 0.64869
H  8.486279 0.093088 0.780695
H  7.757742 -1.426834 0.185232
H  7.843835 0.00008 -0.884653
H  -6.087773 -2.162424 0.551313
H  -6.307275 -1.49336 -1.114209
H  -7.22907 -0.792865 0.270139
