program: Gaussian 09
title: 000208340
version: EM64L-G09RevD.01
frameworkgroup: C1[X(C5H9N3OS)]
method: RPBEPBE
basis: SDD
operation: Freq
keyword: #p
keyword: freq=noraman
keyword: PBEPBE/SDD
title: #p freq=noraman PBEPBE/SDD
converged: NO NO NO NO
title: Mulliken charges:
elementType: S O N N N C C C C C H H H H H H H H H
charge: 0.196632 -0.193865 0.005890 -0.292481 -0.499096 -0.540385 -0.319197 0.088025 -0.677995 -0.172122 0.296321 0.248677 0.226274 0.212833 0.222045 0.226874 0.341941 0.314682 0.314947
chargesum: 0.00000
title: Mulliken charges with hydrogens summed into heavy atoms:
elementType: S O N N N C C C C C
charge: 0.196632 -0.193865 0.005890 0.049460 0.130534 -0.244065 0.155754 0.088025 -0.016243 -0.172122
polarizability: 1.30748666e+02 -5.97308256e+00 1.04065014e+02 4.98017925e+00 1.82931402e+00 5.83487611e+01
1716.lowfreq: -0.0019 -0.0014 -0.0010 11.0733 14.3007 20.8933 47.8591 101.8049 128.5334
frequency: 47.8282 101.7820 128.5296 161.3811 174.6262 189.3105 198.1112 236.7875 287.5395 350.8652 379.6397 429.2227 512.1180 535.9208 584.1623 621.9267 642.1034 678.0278 751.7503 798.1757 809.3472 861.3706 922.6228 1045.6147 1076.7115 1088.2295 1110.0262 1156.4285 1186.2375 1228.3822 1250.1255 1279.4609 1287.9386 1338.5878 1392.5691 1457.5858 1457.9467 1475.4907 1482.6900 1553.1701 1648.8594 1679.1669 2977.3346 2993.5709 3039.1561 3053.7948 3078.4917 3081.3096 3394.5162 3511.9334 3561.1355
redmass: 5.1772 2.4200 3.3437 2.2717 1.5684 4.5521 2.7859 1.3250 3.8585 3.3669 5.1920 10.3083 6.2614 1.5178 6.8810 3.1844 6.0293 3.2210 4.0236 2.0463 1.4043 3.8121 2.5074 1.5930 2.0748 2.7019 3.2448 5.8423 1.3218 1.3395 2.8668 1.2536 1.1533 1.3929 1.2113 1.0752 1.3806 1.0474 1.0486 10.5076 11.6101 1.0632 1.0359 1.0598 1.0903 1.0952 1.1013 1.0993 1.0430 1.0990 1.0794
irintensity: 1.5139 0.5449 4.5988 1.2713 16.3488 8.3925 9.8840 3.8394 4.2695 7.6855 17.0089 1.7169 14.3968 140.9696 9.6566 25.7037 5.5582 7.0373 18.3441 174.5508 3.6854 7.6827 15.9828 1.8460 37.8083 38.9463 49.0812 141.7646 2.3092 2.3649 46.8495 4.8637 0.5699 3.2975 18.2599 7.0189 97.1669 16.9257 12.8169 766.9906 40.3594 32.6711 26.0198 10.6392 0.9071 1.2807 44.8073 42.6261 2.8550 5.5091 85.5763
temp: 298.150 k
press: 1.00000 atm
elementType: 16 8 7 7 7 6 6 6 6 6 1 1 1 1 1 1 1 1 1
symmnumber: 1
zpe: 384537.3 jmol-1
zpe.correction: 0.146463 hartree
zpe.thermalcorrener: 0.157426 hartree
zpe.thermalcorrenthalpy: 0.158370 hartree
zpe.thermalcorrgfe: 0.109532 hartree
zpe.sumelectzpe: -832.671034 hartree
zpe.sumelectthermal: -832.660071 hartree
zpe.sumelectthermalent: -832.659126 hartree
zpe.sumelectthermalfe: -832.707964 hartree
dipole: 0.6514 -3.5698 0.2304
dipole: 3.6361
quadrupole: -58.9171 -78.2131 -64.8555
quadrupole: 1.9633 0.0122 0.3245
quadrupole: 8.4115 -10.8845 2.4731 1.9633 0.0122 0.3245
hfenergy: -832.8174964 hartree
pointgroup: C01 [X(C5H9N3O1S1)]
dipole: -0.2572967 1.3988369 -0.153271 debye
dipolederiv: -0.6206033 -0.1882508 0.0883735 -0.0906664 -0.4228809 0.1421066 0.1036032 0.134114 -0.1267447 -0.6213417 0.2202035 -0.0122366 0.338368 -1.1348341 0.098707 -0.0440804 0.1562249 -0.3543234 -1.2373732 0.5089821 0.0059935 0.4489707 -1.2859876 0.1744994 0.0814216 0.1869272 -0.2751605 -0.9137109 0.3038166 -0.0119739 0.5263572 -0.271576 -0.1281464 -0.032982 -0.0978349 -0.3782417 -0.3700068 0.1388495 0.0144462 0.2937661 -0.2488526 0.0057513 -0.0185234 0.0270785 -0.0481022 0.051603 -0.363147 0.1039317 -0.5408215 -0.0348733 0.0484027 0.1265019 0.0827821 0.1367883 0.113932 0.0432172 -0.0254784 0.1063962 0.032518 0.0639108 0.0691557 0.0469816 0.0819831 1.3083164 -0.5524391 -0.0459039 -0.2679984 1.3730988 -0.1879402 -0.1746998 -0.228317 0.1972623 -0.0127891 -0.0828022 -0.0007362 -0.0866589 0.0191874 0.0217159 -0.0543053 0.0134178 0.0622815 1.5813635 -0.0696478 -0.2082171 -0.4606597 1.3931577 -0.2357529 -0.1755382 -0.3167383 0.1892555 0.0304586 0.041806 0.0455012 0.0790511 0.0443458 -0.0252977 0.0116389 -0.022313 -0.0252357 0.0046046 0.0243371 -0.0211651 0.0532278 -0.0628236 0.0289748 -0.0451797 0.0166167 0.0867098 0.0116252 0.0019094 0.1025956 -0.0272868 0.0568193 -0.057594 0.0604866 -0.0281868 -0.0889715 0.0516731 0.0006514 0.0700682 0.0321165 0.0497168 -0.0775791 0.1266666 -0.0413314 -0.1130752 0.0506255 0.1290479 -0.0143229 0.0748853 -0.083142 0.0282021 0.015486 0.0382568 0.0848241 -0.1095249 -0.0569747 -0.1139664 -0.0352635 0.0940903 -0.0060589 -0.1518612 -0.0229104 -0.0128115 0.1582729 -0.0950236 0.0633553 -0.1484551 0.1958642 0.0629965 0.0703736 0.0590203 0.3199259 0.2242572 -0.0186299 -0.1230298 -0.1557358 0.1836449 0.1198844 -0.0856884 0.0537479 0.1240482 0.2986181 0.0140943 0.082765 -0.1395928 0.1025269 -0.076782 0.1175242 -0.0575359 0.1395877 unknown
polarizability: 130.7456984|-6.7409301|102.0667002|-3.9626691|-9.5002346|60.350042 unknown
InChI: InChI=1S/C5H9N3OS/c1-2-3-4(9)7-5(8-6)10-3/h3,8H,2,6H2,1H3
charge 0 multiplicity 1
19 atoms
S  0.116857 1.578056 -0.636867
O  0.707041 -2.275845 0.245902
N  -1.105274 -0.749868 0.192918
N  -2.55041 1.114761 -0.021881
N  -3.728075 0.417458 0.369046
C  1.207093 0.034292 -0.40533
C  2.34443 0.253429 0.613958
C  0.248283 -1.126052 0.040464
C  3.394745 1.280222 0.147745
C  -1.321268 0.523948 -0.096803
H  1.621717 -0.217597 -1.397866
H  2.817146 -0.736528 0.764734
H  1.911016 0.559932 1.584598
H  3.849255 0.976949 -0.814128
H  2.945245 2.281659 0.012816
H  4.206352 1.371638 0.891455
H  -2.67673 2.099075 -0.259914
H  -3.625631 0.061076 1.330385
H  -3.912793 -0.359103 -0.28273
