program: Gaussian 09
title: 000208320
version: EM64L-G09RevD.01
frameworkgroup: C1[X(C16H21N3O2)]
method: RPBEPBE
basis: SDD
operation: Freq
keyword: #p
keyword: freq=noraman
keyword: PBEPBE/SDD
title: #p freq=noraman PBEPBE/SDD
converged: YES YES NO NO
title: Mulliken charges:
elementType: O O N N N C C C C C C C C C C C C C C C C H H H H H H H H H H H H H H H H H H H H H
charge: -0.250088 -0.267039 -0.199484 -0.412118 -0.358193 0.155031 0.251017 -0.442187 -0.324065 0.130001 0.177043 -0.336731 0.509419 -0.809001 -0.644361 -0.691351 -0.338343 -0.322588 -0.220261 -0.219574 -0.237731 0.210130 0.278597 0.189455 0.174984 0.289963 0.204989 0.204688 0.241486 0.247289 0.252253 0.236156 0.236413 0.289663 0.209450 0.216527 0.203914 0.241745 0.245181 0.225284 0.225499 0.226938
chargesum: 0.00000
title: Mulliken charges with hydrogens summed into heavy atoms:
elementType: O O N N N C C C C C C C C C C C C C C C C
charge: -0.250088 -0.267039 -0.199484 -0.122155 -0.358193 0.155031 0.251017 0.046540 0.040374 0.130001 0.177043 0.072947 0.509419 -0.067973 0.117871 -0.061459 -0.096598 -0.077407 0.005023 0.005925 -0.010793
polarizability: 2.51013807e+02 -1.01928211e+01 2.19270252e+02 7.67631435e+00 5.11041879e+00 1.45157776e+02
1716.lowfreq: -15.1150 -8.1865 -6.7250 -0.0008 -0.0006 -0.0004 9.3446 21.3917 34.6950
frequency: -10.8335 21.3197 34.6885 45.6955 64.6001 73.9904 77.8598 93.4367 103.4734 120.6469 147.0894 192.4976 201.2876 223.8702 230.6770 241.6012 261.4044 284.1004 302.8062 334.0928 353.3328 376.4145 389.0920 402.9569 405.8947 418.7202 430.1475 454.1204 486.5612 501.4991 518.8100 554.7622 586.0649 614.4705 651.0381 691.5237 700.0783 703.3480 736.7170 742.1928 763.0641 805.5176 835.4221 839.5708 844.6617 895.0373 921.8674 947.7231 967.1353 968.0112 977.9254 990.7794 991.6715 1025.4958 1032.0216 1034.7259 1058.3783 1075.7391 1080.7254 1111.0171 1119.5180 1129.0366 1144.8187 1151.3584 1171.4958 1171.8009 1184.3386 1225.1990 1239.2857 1257.3248 1287.0086 1292.8560 1309.4104 1314.2462 1330.4912 1342.0131 1362.4024 1386.2340 1387.3842 1393.7349 1424.8048 1432.0665 1439.7913 1451.8020 1458.1682 1468.5799 1474.9167 1476.2828 1480.9081 1482.3969 1483.1197 1487.6980 1493.8893 1505.3939 1567.6203 1603.4017 1607.3153 1610.8051 1625.2559 2946.4764 2961.2209 2970.3541 2974.6427 2990.3716 2991.2938 2998.7727 3028.7748 3039.8235 3066.7602 3071.2146 3081.1607 3093.5206 3100.2146 3124.9898 3128.4350 3140.4308 3153.7026 3164.9498 3173.9057 3552.9586
redmass: 3.7331 3.6987 4.4822 4.9893 4.6613 3.3004 1.9658 2.1300 1.6811 2.0476 6.3359 3.4741 1.4269 1.1895 2.1560 3.1431 3.6040 3.0036 3.3956 2.0250 3.0332 3.8829 5.7184 1.6020 2.8090 6.9344 5.6205 5.5042 3.4895 3.8183 3.0671 5.0710 6.8346 6.4058 6.3836 2.2272 10.6893 2.4340 5.7373 1.2457 1.9496 2.3910 1.9180 1.8315 1.5711 1.9549 1.7347 1.6576 1.4017 2.0731 2.2424 1.3248 6.1206 2.1247 1.4626 2.5703 2.0673 2.2511 1.6697 2.0832 1.4042 3.2277 3.7872 3.0369 1.0527 2.3430 1.2832 1.5180 1.7286 2.1656 1.1350 2.6594 1.5315 1.3205 2.5069 1.6793 1.5015 10.1536 1.2165 1.3377 1.5674 1.6977 2.1947 1.1724 1.0852 1.1917 1.0518 1.0499 1.3150 1.1619 1.7120 1.1037 1.2318 1.0595 8.6809 6.5753 6.5923 6.4266 9.5213 1.0599 1.0438 1.0356 1.0600 1.0775 1.0388 1.0864 1.1022 1.0928 1.1007 1.0994 1.1006 1.0961 1.0952 1.0995 1.0849 1.0890 1.0937 1.0971 1.1004 1.0753
irintensity: 0.0498 0.2469 0.0903 5.1249 0.8894 1.6757 0.3756 2.7547 0.0902 1.1820 1.6816 2.3631 0.0672 0.0825 0.1460 2.1802 2.9324 8.9718 3.1830 54.9476 2.2432 11.8276 1.6596 43.8013 0.0776 14.7143 6.0854 14.4219 5.9380 6.1063 31.2867 3.5337 2.9291 0.7491 24.4709 21.1741 3.8899 38.6242 5.3002 20.5024 37.6978 7.9713 9.2325 12.6039 1.3222 2.7325 4.4922 3.5753 0.1866 1.3611 6.9829 0.2582 1.9860 8.1272 8.8951 3.0424 5.8778 12.7227 7.3095 10.9354 5.8582 15.5876 19.0525 12.1608 0.0784 83.7589 8.4320 22.2408 10.7900 8.9428 12.8366 108.7449 48.3678 3.7674 82.6143 44.8264 2.6869 1.9488 12.2119 12.8441 51.1650 66.1037 9.2871 68.5953 8.8757 15.0771 3.6561 14.2454 47.4884 24.5380 27.8333 15.2833 29.3743 15.3042 546.6517 36.2834 99.1920 108.2537 113.0727 38.1838 32.1170 56.8732 38.3718 45.5224 65.7950 69.4593 28.9600 14.0212 72.6382 45.1567 25.6126 11.6686 10.8970 0.3261 0.0187 9.5857 38.6673 19.8071 5.4322 16.1514
temp: 298.150 k
press: 1.00000 atm
elementType: 8 8 7 7 7 6 6 6 6 6 6 6 6 6 6 6 6 6 6 6 6 1 1 1 1 1 1 1 1 1 1 1 1 1 1 1 1 1 1 1 1 1
symmnumber: 1
zpe: 905977.0 jmol-1
zpe.correction: 0.345068 hartree
zpe.thermalcorrener: 0.365670 hartree
zpe.thermalcorrenthalpy: 0.366614 hartree
zpe.thermalcorrgfe: 0.294760 hartree
zpe.sumelectzpe: -935.458959 hartree
zpe.sumelectthermal: -935.438357 hartree
zpe.sumelectthermalent: -935.437413 hartree
zpe.sumelectthermalfe: -935.509267 hartree
dipole: -4.5845 2.4514 0.1820
dipole: 5.2020
quadrupole: -113.1212 -115.1609 -128.2378
quadrupole: -12.2471 -1.0611 -8.2319
quadrupole: 5.7187 3.6791 -9.3978 -12.2471 -1.0611 -8.2319
hfenergy: -935.8040272 hartree
pointgroup: C01 [X(C16H21N3O2)]
dipole: 1.7578554 1.0353445 0.1631187 debye
polarizability: 248.161084|10.385677|220.3405725|16.9680606|3.0954837|146.9401789 unknown
InChI: InChI=1S/C16H21N3O2/c1-4-5-11-17-14-12(2)18(3)16(21)19(15(14)20)13-9-7-6-8-10-13/h6-10,17H,4-5,11H2,1-3H3
charge 0 multiplicity 1
42 atoms
O  0.074988 -1.534376 1.125301
O  -1.910593 2.236726 -0.849538
N  0.293874 2.406347 -0.062514
N  2.491622 -0.053426 1.678258
N  -0.866901 0.32629 0.053461
C  1.415313 0.488888 0.955431
C  1.446905 1.806334 0.492541
C  3.00109 -1.439951 1.597491
C  4.117972 -1.64668 0.541256
C  0.207062 -0.330688 0.749851
C  -0.895889 1.694208 -0.321462
C  3.6469 -1.444805 -0.916888
C  -2.062236 -0.463956 -0.230838
C  2.700935 2.641339 0.614485
C  0.280745 3.83931 -0.430584
C  4.771679 -1.688454 -1.946321
C  -1.970886 -1.552791 -1.123531
C  -3.287773 -0.139794 0.388005
C  -3.119392 -2.326165 -1.398376
C  -4.434469 -0.913409 0.105678
C  -4.353488 -2.007907 -0.785885
H  3.390299 -1.71062 2.598658
H  2.144734 -2.101223 1.393047
H  4.509506 -2.679666 0.656907
H  4.969283 -0.965008 0.755098
H  3.12947 0.619894 2.102926
H  3.249652 -0.417427 -1.037501
H  2.799859 -2.131117 -1.118779
H  3.587253 1.992427 0.489633
H  2.788849 3.138882 1.602006
H  2.755145 3.428788 -0.153127
H  0.908945 4.032856 -1.318849
H  0.63184 4.458502 0.411546
H  -0.758606 4.101082 -0.677531
H  5.164374 -2.719914 -1.867568
H  4.412176 -1.542392 -2.981556
H  5.619064 -0.995655 -1.781547
H  -1.009701 -1.797031 -1.586209
H  -3.344606 0.715051 1.068148
H  -3.049734 -3.174465 -2.087928
H  -5.388734 -0.660383 0.580297
H  -5.244727 -2.607719 -1.001592
