program: Gaussian 09
title: 000208319
version: EM64L-G09RevD.01
frameworkgroup: C1[X(C14H17N3O2)]
method: RPBEPBE
basis: SDD
operation: Freq
keyword: #p
keyword: freq=noraman
keyword: PBEPBE/SDD
title: #p freq=noraman PBEPBE/SDD
converged: YES YES NO NO
title: Mulliken charges:
elementType: O O N N N C C C C C C C C C C C C C C H H H H H H H H H H H H H H H H H
charge: -0.231743 -0.251889 -0.196469 -0.349637 -0.230445 0.102064 0.283276 0.140757 0.174115 0.502363 -0.761065 -0.611751 -0.633994 -0.634875 -0.338441 -0.331008 -0.218709 -0.219071 -0.238736 0.229452 0.230743 0.295984 0.233470 0.233626 0.288607 0.220137 0.211874 0.247067 0.212919 0.219724 0.244593 0.250143 0.245608 0.226779 0.226452 0.228080
chargesum: 0.00000
title: Mulliken charges with hydrogens summed into heavy atoms:
elementType: O O N N N C C C C C C C C C C C C C C
charge: -0.231743 -0.251889 -0.196469 -0.349637 -0.230445 0.102064 0.283276 0.140757 0.174115 0.502363 -0.004886 0.143952 0.045084 0.042362 -0.088298 -0.085400 0.008069 0.007381 -0.010656
polarizability: 2.30881345e+02 1.02212724e+01 1.83681072e+02 -3.77749918e+00 1.17687630e+01 1.23991690e+02
1716.lowfreq: -7.5315 0.0004 0.0007 0.0007 7.2385 8.8621 34.0655 37.7198 55.3475
frequency: 34.0202 37.6864 55.3257 70.6525 75.9062 91.8746 126.0031 153.6782 166.2453 176.9642 201.3345 211.0896 238.6444 251.5279 260.9575 272.3177 290.8087 351.3818 376.1018 395.4612 405.7277 417.5054 425.2993 452.3586 477.8518 488.8993 507.0442 584.1151 586.1318 615.0848 642.6264 690.9544 702.4713 717.0427 756.1416 770.2007 798.0564 836.6722 858.5686 912.5333 954.5323 962.5680 966.8553 991.0606 991.6695 1025.7683 1034.2643 1049.3863 1054.3031 1078.9152 1083.4186 1092.3313 1121.2468 1121.6410 1141.5178 1152.5153 1172.0185 1183.6692 1192.4468 1194.3575 1242.3276 1294.7027 1315.7425 1331.6667 1370.5458 1386.2649 1396.8712 1412.0433 1431.2738 1433.6032 1440.5400 1445.3883 1454.9353 1465.4631 1477.4513 1479.9314 1481.3419 1486.9056 1500.4664 1503.4630 1569.9208 1603.1086 1607.5399 1616.4133 1628.8420 2936.4745 2942.9895 2980.7099 3000.7360 3031.1560 3032.5044 3060.4186 3073.9782 3078.6382 3089.6124 3109.5932 3129.4181 3129.8007 3141.4437 3155.8688 3167.5027 3175.4567
redmass: 3.3889 3.5661 3.4155 6.2082 4.6308 1.6691 1.4865 5.5172 2.8617 3.1085 1.1685 1.1013 1.5461 5.3726 3.0674 2.0889 3.5418 2.7695 3.4381 5.4190 2.8151 6.1162 7.2233 5.6557 4.7019 4.1792 3.6069 4.7896 6.5506 6.2704 6.7694 2.3205 2.5083 9.8837 2.3718 5.3624 5.4154 1.2614 4.4592 1.4930 2.9187 2.8827 1.4147 1.3631 5.3593 2.1278 1.6494 1.5226 2.0645 1.7150 1.2307 2.4493 5.9844 1.2994 1.4275 3.9376 1.0508 1.1522 3.4471 2.3410 3.7272 5.0270 1.3137 5.2096 1.4537 10.2554 2.3188 1.1331 1.2072 1.3971 2.1709 1.1231 1.0447 1.0702 1.0624 1.1392 2.1262 1.0503 1.0704 1.0455 8.8310 6.8320 6.5635 7.5026 9.6988 1.0392 1.0396 1.0372 1.0344 1.0933 1.0938 1.0973 1.1006 1.1005 1.1027 1.0983 1.0850 1.0993 1.0893 1.0941 1.0966 1.1001
irintensity: 0.3865 0.2170 5.9565 0.3684 1.8908 0.3690 0.2719 2.3575 5.0111 0.4622 0.9789 0.4441 0.8143 7.7789 2.2590 0.6978 3.5578 0.8056 0.0305 2.6895 0.0534 3.5148 15.4722 27.5249 0.3070 4.2097 16.1674 0.6199 1.2035 0.8501 26.8263 20.4979 33.4845 4.5924 16.8421 31.2225 14.8307 0.3708 6.5590 1.8071 11.4868 13.4855 1.1242 0.7532 1.5991 4.9064 15.2961 2.0352 12.1209 20.6147 1.4654 111.6360 40.4537 0.1921 0.4715 8.5686 0.0116 3.0746 8.7205 6.2072 6.7702 122.6998 4.0069 98.9352 10.3003 1.5483 105.0756 5.5812 14.0748 153.2536 4.4688 0.9672 5.1801 42.7649 20.2521 49.5894 24.8061 5.4190 35.7933 33.2713 319.5511 4.4147 14.4644 257.4291 189.7556 66.0819 78.5001 17.9659 57.7745 46.9298 31.1931 9.7601 19.2902 55.1990 23.2079 2.9579 0.0170 0.6294 11.4473 37.2320 16.3216 3.9921
temp: 298.150 k
press: 1.00000 atm
elementType: 8 8 7 7 7 6 6 6 6 6 6 6 6 6 6 6 6 6 6 1 1 1 1 1 1 1 1 1 1 1 1 1 1 1 1 1
symmnumber: 1
zpe: 757599.9 jmol-1
zpe.correction: 0.288555 hartree
zpe.thermalcorrener: 0.307223 hartree
zpe.thermalcorrenthalpy: 0.308168 hartree
zpe.thermalcorrgfe: 0.241352 hartree
zpe.sumelectzpe: -857.003686 hartree
zpe.sumelectthermal: -856.985017 hartree
zpe.sumelectthermalent: -856.984073 hartree
zpe.sumelectthermalfe: -857.050889 hartree
dipole: 3.4435 1.6884 -0.0633
dipole: 3.8357
quadrupole: -97.1906 -114.6094 -106.5882
quadrupole: 9.8859 -1.6960 4.7463
quadrupole: 8.9388 -8.4800 -0.4588 9.8859 -1.6960 4.7463
hfenergy: -857.2922408 hartree
pointgroup: C01 [X(C14H17N3O2)]
dipole: 1.3471289 0.6765765 -0.069096 debye
polarizability: 230.582144|10.5828182|184.9192209|-5.2732339|8.6179863|123.0527415 unknown
InChI: InChI=1S/C14H17N3O2/c1-10-12(15(2)3)13(18)17(14(19)16(10)4)11-8-6-5-7-9-11/h5-9H,1-4H3
charge 0 multiplicity 1
36 atoms
O  0.163268 -2.027689 0.19439
O  -0.897344 2.534335 -0.314609
N  1.356887 1.887699 -0.243798
N  -0.388817 0.252158 -0.053897
N  2.995004 -1.453812 0.172561
C  1.980104 -0.440463 0.038744
C  2.339557 0.89243 -0.117808
C  0.564106 -0.833482 0.068248
C  -0.040533 1.61366 -0.20891
C  -1.811163 -0.073888 -0.007748
C  3.7851 1.319061 -0.158001
C  1.735845 3.308909 -0.41784
C  3.022481 -2.1253 1.496957
C  3.070809 -2.404856 -0.965437
C  -2.35491 -0.947954 -0.973431
C  -2.623905 0.471698 1.009453
C  -3.72686 -1.276545 -0.919373
C  -3.995955 0.143584 1.054452
C  -4.550736 -0.731519 0.092023
H  4.019602 2.045402 0.642141
H  4.045457 1.793206 -1.122753
H  4.397961 0.415208 -0.022148
H  2.354042 3.439534 -1.321903
H  2.292354 3.677832 0.460852
H  0.805618 3.885139 -0.525186
H  3.050867 -1.363771 2.296015
H  3.943633 -2.733022 1.568877
H  2.144582 -2.785494 1.663905
H  3.994883 -3.004576 -0.867762
H  3.126397 -1.841989 -1.913822
H  2.200861 -3.094839 -1.009134
H  -1.709497 -1.376315 -1.745346
H  -2.190846 1.156413 1.744628
H  -4.14955 -1.95808 -1.665473
H  -4.629258 0.571356 1.839167
H  -5.615546 -0.986731 0.130569
