program: Gaussian 09
title: 000208318
version: EM64L-G09RevD.01
frameworkgroup: C1[X(C11H15BrN2O2)]
method: RPBEPBE
basis: SDD
operation: Freq
keyword: #p
keyword: freq=noraman
keyword: PBEPBE/SDD
title: #p freq=noraman PBEPBE/SDD
converged: YES YES NO NO
title: Mulliken charges:
elementType: Br O O N N C C C C C C C C C C C H H H H H H H H H H H H H H H
charge: 0.055460 -0.271596 -0.241698 -0.251697 -0.219263 0.021159 -0.487642 -0.487300 -0.425261 -0.424974 0.452248 0.244130 -0.459844 -0.790833 0.281289 -0.600852 0.176344 0.223053 0.275538 0.275087 0.222992 0.219918 0.216729 0.216801 0.219910 0.276117 0.234088 0.276105 0.272731 0.250686 0.250575
chargesum: 0.00000
title: Mulliken charges with hydrogens summed into heavy atoms:
elementType: Br O O N N C C C C C C C C C C C
charge: 0.055460 -0.271596 -0.241698 -0.251697 -0.219263 0.197503 0.010949 0.010778 0.011386 0.011737 0.452248 0.244130 -0.459844 -0.004523 0.281289 0.173140
polarizability: 2.16192215e+02 -5.94605880e-01 1.55778409e+02 1.38048369e-02 -1.67472060e-03 9.51180354e+01
1716.lowfreq: -132.6844 -78.4421 -13.6961 -9.0210 -6.1572 -0.0010 -0.0009 -0.0007 32.6248
frequency: -132.6825 -78.3650 32.3941 43.2681 83.6470 97.1681 99.3306 122.0506 167.5351 188.8528 222.2611 231.9177 249.8535 293.2364 294.3512 355.6389 391.9713 402.2171 407.6181 450.4985 494.9311 567.5061 603.7127 618.0330 624.2650 666.8026 709.1966 734.0468 757.8423 788.3838 813.9808 868.3199 890.3852 931.4000 963.7230 967.3687 975.8259 998.3027 1036.5084 1042.6621 1043.5105 1067.2446 1103.9882 1127.9501 1136.9301 1173.4447 1175.8227 1186.4803 1223.0674 1228.8802 1244.2149 1269.9979 1292.2695 1294.2748 1304.9735 1306.1239 1307.0727 1356.2308 1378.8380 1411.3603 1424.7651 1461.8846 1465.7753 1472.9774 1473.3831 1474.7103 1475.3157 1482.6335 1492.4715 1551.2845 1602.3170 1626.1576 2997.2667 3006.2122 3009.9233 3014.0959 3020.2464 3028.5251 3053.4406 3073.8458 3078.1350 3083.5161 3100.5677 3106.0401 3115.3176 3143.9586 3145.3232
redmass: 1.1568 1.5927 3.5468 4.4581 3.1944 2.9944 4.3301 1.0421 6.6435 5.3774 6.2836 4.6176 4.1797 5.9123 5.0263 3.1460 4.2851 9.2835 5.9293 5.6648 2.3625 4.6754 7.3669 3.1128 6.2485 3.7326 11.9460 10.0668 1.5594 3.0309 1.4347 3.4843 2.6829 2.8640 1.6291 1.5224 1.6549 2.8467 1.4797 1.8743 2.8702 2.7597 3.9158 1.3104 5.3425 2.5566 1.5099 2.2117 1.6845 1.1836 2.8597 1.2873 1.2928 1.1892 1.4273 1.4744 5.0146 2.2296 1.7389 1.1423 1.2607 1.0431 1.0776 1.0864 1.0788 1.0824 1.0443 1.1592 1.1015 8.7737 10.0214 9.5631 1.0619 1.0411 1.0622 1.0329 1.0628 1.0657 1.1012 1.0986 1.0973 1.0912 1.1016 1.1021 1.0987 1.1023 1.0927
irintensity: 0.0283 0.0116 0.0015 0.7840 0.0594 3.6839 5.3376 0.0008 0.4226 0.6312 0.1723 2.1101 2.0379 0.2341 2.4733 12.6051 0.8501 23.3183 0.4075 4.5442 4.2023 0.5662 5.4604 1.1121 37.2541 3.9358 0.0786 27.0831 16.8470 1.1751 0.2517 1.4644 9.3951 14.4026 12.5520 0.4845 7.5697 52.4751 6.0720 24.7048 0.1328 3.0190 1.5734 0.1054 17.3315 9.7938 0.2449 49.1478 9.3485 0.7242 1.4831 0.1021 46.3243 3.7772 1.0053 44.8140 78.6006 48.6140 44.2139 17.9606 94.9392 15.9213 1.6782 7.5741 8.2814 12.3674 14.7432 17.7280 13.5922 78.7104 677.4787 194.1821 11.8738 3.8775 62.3995 22.2259 74.2590 20.0494 4.1523 23.4694 3.4594 8.6467 1.9340 15.6137 38.2405 1.5461 24.8739
temp: 298.150 k
press: 1.00000 atm
elementType: 35 8 8 7 7 6 6 6 6 6 6 6 6 6 6 6 1 1 1 1 1 1 1 1 1 1 1 1 1 1 1
symmnumber: 1
zpe: 650767.1 jmol-1
zpe.correction: 0.247864 hartree
zpe.thermalcorrener: 0.262687 hartree
zpe.thermalcorrenthalpy: 0.263631 hartree
zpe.thermalcorrgfe: 0.204257 hartree
zpe.sumelectzpe: -700.387300 hartree
zpe.sumelectthermal: -700.372477 hartree
zpe.sumelectthermalent: -700.371533 hartree
zpe.sumelectthermalfe: -700.430907 hartree
dipole: -4.0483 -3.8111 -0.0054
dipole: 5.5600
quadrupole: -116.3395 -98.9026 -103.6354
quadrupole: -0.0798 0.0196 0.0025
quadrupole: -10.0470 7.3899 2.6571 -0.0798 0.0196 0.0025
hfenergy: -700.6351638 hartree
pointgroup: C01 [X(C11H15Br1N2O2)]
dipole: 1.9326057 1.0247082 -0.0040157 debye
polarizability: 211.6131557|-15.8619109|160.2343561|-2.6096654|2.3728445|95.2411477 unknown
InChI: InChI=1S/C11H15BrN2O2/c1-7-9(12)10(15)13(2)11(16)14(7)8-5-3-4-6-8/h8H,3-6H2,1-2H3
charge 0 multiplicity 1
31 atoms
Br -3.38277 2.36391 0.152117
O  0.728758 -2.053013 -0.059599
O  -3.748379 -0.730062 0.058786
N  0.286566 0.266102 0.015812
N  -1.489093 -1.3696 -0.002384
C  1.768814 0.524408 -0.00303
C  2.527243 0.011555 -1.256506
C  2.568771 -0.053004 1.195539
C  4.020153 0.150651 -0.837852
C  4.047164 0.107454 0.734482
C  -0.672697 1.303505 0.066573
C  -0.108331 -1.105539 -0.018986
C  -2.022107 0.97885 0.081124
C  -0.264254 2.7633 0.105898
C  -2.532858 -0.388606 0.047007
C  -1.875949 -2.799463 -0.037841
H  1.894003 1.616232 0.023325
H  2.280426 0.595771 -2.161026
H  2.270694 -1.043548 -1.436978
H  2.316348 -1.116055 1.329478
H  2.353968 0.483105 2.137282
H  4.440942 1.106135 -1.201421
H  4.628591 -0.657214 -1.279032
H  4.667824 -0.724121 1.10959
H  4.482909 1.041055 1.135337
H  -0.705378 3.294616 -0.755864
H  0.817672 2.938442 0.094935
H  -0.678377 3.239198 1.012254
H  -2.974258 -2.838894 -0.017225
H  -1.4502 -3.325998 0.831745
H  -1.485692 -3.272271 -0.953742
