program: Gaussian 09
title: 000208313
version: EM64L-G09RevD.01
frameworkgroup: C1[X(C11H14N3O3S)]
method: RPBEPBE
basis: SDD
operation: Freq
keyword: #p
keyword: freq=noraman
keyword: PBEPBE/SDD
title: #p freq=noraman PBEPBE/SDD
converged: YES YES NO NO
title: Mulliken charges:
elementType: S O O O N N N C C C C C C C C C C C H H H H H H H H H H H H H H
charge: 0.800169 -0.318295 -0.423712 -0.416479 -0.572634 0.092356 0.088288 -0.157866 0.023824 -0.635411 0.293053 -0.253325 -0.235545 0.450124 -0.324214 -0.361308 -0.778982 -0.268803 0.292124 0.354779 0.233911 0.258005 0.247928 0.298391 0.300867 0.271725 0.269426 0.244287 0.248983 0.265202 0.316565 0.396566
chargesum: 1.00000
title: Mulliken charges with hydrogens summed into heavy atoms:
elementType: S O O O N N N C C C C C C C C C C C
charge: 0.800169 -0.318295 -0.423712 -0.019913 -0.217855 0.092356 0.088288 0.134258 0.023824 0.104434 0.293053 0.045066 0.065322 0.450124 -0.052489 -0.091882 -0.020510 0.047762
polarizability: 3.50113791e+02 -3.74642249e+01 2.12930065e+02 7.68985794e+00 6.58158578e+00 1.14140228e+02
1716.lowfreq: -9.3014 -5.0032 -0.0018 -0.0015 -0.0015 4.9560 23.5527 29.1098 44.0598
frequency: 23.1925 29.0405 44.0141 48.1847 64.0930 84.3143 109.7444 128.5551 144.0469 160.7793 184.3484 198.8230 221.5900 234.7354 243.1022 269.8720 279.5320 303.4065 344.0249 366.0712 376.3851 401.6116 413.4942 440.9444 473.9468 474.3570 487.9354 489.3995 517.4079 551.6879 588.3399 597.6629 613.1306 663.3900 685.9463 744.1971 772.9396 792.0010 799.3310 823.5714 833.5758 892.4174 909.6707 967.1531 967.7867 987.0049 988.5289 995.4547 1031.4301 1044.4302 1046.7566 1081.1767 1115.0392 1131.6464 1149.9810 1170.7781 1195.9262 1223.4184 1231.5551 1290.4007 1305.6006 1310.1416 1352.4910 1378.4275 1397.8586 1402.6890 1404.6627 1440.3401 1458.8630 1463.4037 1469.1630 1471.8629 1472.0971 1571.1050 1573.2945 2059.7573 2987.0189 3004.4027 3006.3661 3070.6538 3104.1374 3107.3558 3113.2231 3147.7355 3151.4006 3165.3082 3171.3944 3201.7127 3389.7425 3489.5754
redmass: 1.2162 3.2660 4.1168 5.3869 5.7105 10.1973 4.4948 7.6128 6.1755 3.2805 4.1068 1.3114 4.6278 4.3332 4.2692 5.7643 4.2447 4.1295 6.1265 3.6114 4.3470 2.8502 5.6905 5.1889 3.9609 4.3035 3.3574 4.2249 1.4788 3.2284 4.9976 2.2015 6.8278 2.9240 3.3029 6.5813 4.6447 2.1903 4.4603 1.3188 1.2485 2.3941 6.3277 2.7668 1.7664 1.4194 1.8757 1.4031 2.4376 2.4682 1.6322 2.4306 2.3176 1.3012 2.3978 2.0454 1.1188 3.2550 1.1805 1.4846 1.2710 1.2430 1.4736 3.7427 3.7002 1.2270 1.1856 2.5606 2.1431 1.1156 1.1405 1.0473 1.0844 6.1398 5.5635 13.3650 1.0407 1.0543 1.0664 1.0931 1.1001 1.1005 1.1010 1.0893 1.0893 1.0975 1.0979 1.0904 1.0771 1.0653
irintensity: 0.3018 1.6367 1.4063 4.2982 0.7613 47.5743 12.5079 9.6567 2.3370 3.5172 1.7725 2.1113 1.6850 11.4927 18.7761 13.2200 8.7161 2.1053 16.3305 1.7586 10.7222 1.3411 17.5712 4.1151 0.7210 59.7618 50.8872 3.8110 85.1456 66.9189 8.6218 82.0905 2.4837 40.9898 1.5146 140.5405 4.8865 28.4266 74.9133 52.4441 5.0633 1.1886 67.2890 8.4420 0.9658 1.6504 9.8571 1.2844 59.5951 30.9307 23.9401 13.4053 39.9512 7.8131 12.5105 58.2699 39.8795 25.9650 23.8322 30.7543 4.3200 0.7905 22.1676 1.6779 15.8834 43.9559 16.1555 75.8335 9.4653 23.5903 44.0253 21.4720 20.9836 12.7133 84.8169 551.1555 0.0800 4.7627 6.3890 11.6158 4.8555 7.3354 8.3430 1.7171 1.7008 2.3227 7.1508 28.2907 53.5454 27.9462
temp: 298.150 k
press: 1.00000 atm
elementType: 16 8 8 8 7 7 7 6 6 6 6 6 6 6 6 6 6 6 1 1 1 1 1 1 1 1 1 1 1 1 1 1
symmnumber: 1
zpe: 622566.9 jmol-1
zpe.correction: 0.237123 hartree
zpe.thermalcorrener: 0.256821 hartree
zpe.thermalcorrenthalpy: 0.257765 hartree
zpe.thermalcorrgfe: 0.187523 hartree
zpe.sumelectzpe: -1213.743927 hartree
zpe.sumelectthermal: -1213.724230 hartree
zpe.sumelectthermalent: -1213.723286 hartree
zpe.sumelectthermalfe: -1213.793527 hartree
dipole: -0.1005 -1.2299 3.1100
dipole: 3.3459
quadrupole: -41.4195 -99.2796 -108.0476
quadrupole: 10.5030 1.0886 -6.3449
quadrupole: 41.4961 -16.3640 -25.1320 10.5030 1.0886 -6.3449
hfenergy: -1213.9810506 hartree
pointgroup: C01 [X(C11H14N3O3S1)]
dipole: -0.3834682 0.0814195 -1.2566342 debye
polarizability: 324.545599|25.980193|207.4166115|-74.6862556|-31.7175491|145.2218733 unknown
InChI: InChI=1S/C11H14N3O3S/c1-8-3-5-10(6-4-8)18(16)14-9(2)11(15,17-18)7-13-12/h3-7,9,14-15H,1-2H3
charge 1 multiplicity 1
32 atoms
S  -0.026788 1.459562 0.688555
O  -1.152242 0.421016 1.920524
O  0.31512 3.022241 0.94802
O  -2.042302 -1.348297 0.475967
N  -1.36194 1.151115 -0.601512
N  -3.365386 -1.581414 2.776727
N  -3.50054 -2.669945 3.192225
C  -2.679166 1.021238 0.116693
C  1.484637 0.499789 0.188431
C  -3.779381 0.689889 -0.906717
C  -2.358154 -0.120111 1.118229
C  2.618377 1.250072 -0.185513
C  1.448693 -0.905801 0.271013
C  3.795556 -0.9000 -0.507589
C  3.770971 0.523556 -0.544622
C  2.623048 -1.594965 -0.093681
C  5.056003 -1.655155 -0.862615
C  -3.246418 -0.35084 2.282181
H  -2.948672 1.934721 0.683135
H  -1.318512 1.900604 -1.31794
H  -3.528005 -0.194007 -1.516313
H  -4.724518 0.485738 -0.374282
H  -3.952783 1.54453 -1.582343
H  2.606646 2.344411 -0.196128
H  0.567724 -1.444534 0.634864
H  4.666298 1.072451 -0.855258
H  2.632468 -2.688631 -0.042125
H  4.845482 -2.699966 -1.143183
H  5.59837 -1.173506 -1.69409
H  5.747687 -1.679314 0.001935
H  -3.689299 0.468469 2.84913
H  -1.651673 -1.155208 -0.419618
