program: Gaussian 09
title: 000208312
version: EM64L-G09RevD.01
frameworkgroup: C1[X(C11H13N3O3S)]
method: RPBEPBE
basis: SDD
operation: Freq
keyword: #p
keyword: freq=noraman
keyword: PBEPBE/SDD
title: #p freq=noraman PBEPBE/SDD
converged: YES YES NO NO
title: Mulliken charges:
elementType: S O O O N N N C C C C C C C C C C C H H H H H H H H H H H H H
charge: 0.927776 -0.527046 -0.528114 -0.215871 -0.563631 0.051448 0.004713 -0.139627 -0.022111 -0.689088 -0.251321 -0.242003 0.169402 0.449277 -0.376299 -0.345203 -0.796328 -0.340381 0.301388 0.316043 0.265805 0.242978 0.210628 0.286562 0.280677 0.247214 0.247189 0.233259 0.230381 0.246032 0.326254
chargesum: 0.00000
title: Mulliken charges with hydrogens summed into heavy atoms:
elementType: S O O O N N N C C C C C C C C C C C
charge: 0.927776 -0.527046 -0.528114 -0.215871 -0.247588 0.051448 0.004713 0.161761 -0.022111 0.030324 0.035240 0.038674 0.169402 0.449277 -0.129086 -0.098013 -0.086657 -0.014127
polarizability: 2.24838378e+02 -5.55156595e+00 2.15950981e+02 1.32284764e+01 6.97647470e+00 1.33328831e+02
1716.lowfreq: -10.0447 -4.7072 -0.0014 0.0008 0.0009 5.6069 8.0465 16.4907 33.5468
frequency: 7.8494 15.7697 33.5181 38.5714 50.6450 65.9041 93.7177 114.7024 124.1284 146.8466 163.6965 175.0522 215.8315 228.6783 248.0843 284.3545 300.8370 307.0793 343.7910 384.2132 394.7349 396.1862 407.9534 427.1912 445.2956 495.5626 515.8637 539.2454 580.3779 600.7272 621.3484 662.0060 708.0231 737.6527 775.7397 797.8853 802.4793 830.9097 851.0897 868.2439 909.6184 941.1931 965.2375 983.8564 990.0233 995.3302 998.2935 1049.9109 1052.9590 1062.2339 1109.7477 1119.8484 1126.6175 1140.4005 1185.7550 1219.2669 1241.7338 1265.5974 1297.6122 1347.4546 1361.1061 1381.0260 1387.7880 1392.3993 1400.4851 1463.5309 1470.8628 1472.9883 1474.9533 1476.3593 1576.1943 1594.6165 1595.9995 2050.0280 2943.1649 2982.4326 2990.8287 3064.4271 3088.9925 3094.4811 3114.4499 3137.5547 3139.8555 3162.3057 3165.3720 3169.5420 3353.9770
redmass: 6.4179 5.8216 1.1388 3.6920 4.4901 4.7240 6.1120 5.8168 6.7288 4.4635 6.7270 8.9816 1.0788 8.4928 5.6901 5.0270 3.7541 5.0475 5.4808 3.8753 3.8854 4.0651 2.8738 8.4887 9.8804 4.2919 4.4244 6.6207 4.6499 4.1267 6.9235 1.5041 3.3099 2.7749 5.0423 2.5087 5.7331 1.3699 1.2447 3.1409 2.4767 4.7032 1.3012 1.4008 1.7943 2.8573 2.6609 1.5975 2.4659 1.8812 2.6525 1.3109 1.8487 2.0819 1.1458 2.9929 1.4009 1.2159 1.2658 2.9215 1.3750 5.5554 1.2067 2.9241 1.2456 1.0478 1.0865 2.1874 1.1113 1.0501 10.7078 6.2590 6.5981 13.0804 1.0801 1.0387 1.0367 1.0954 1.0994 1.0998 1.1001 1.0891 1.0891 1.0956 1.0969 1.0891 1.0745
irintensity: 1.2127 0.7219 0.4851 2.4110 5.2043 2.1439 0.8609 0.5223 1.5478 1.1189 1.9029 8.8609 0.5120 11.6859 2.3501 6.3639 4.7974 6.6165 4.6735 3.5067 4.4689 15.7278 0.2983 41.6034 60.7743 10.8147 65.0467 12.7936 14.2823 28.7949 0.5434 31.6409 0.7396 53.0555 13.5311 76.9275 103.4796 34.2049 0.9104 46.2278 15.2415 46.9344 1.1728 0.7576 1.9034 3.2728 17.6923 24.4731 23.8006 2.3658 23.2773 11.3449 3.6539 45.2708 9.5872 6.8186 24.4421 5.2616 2.5576 289.6426 71.0594 1.8918 42.5979 10.3112 17.1716 9.2423 17.2772 24.4300 14.5597 22.5370 196.1612 7.0442 3.0486 538.8351 22.3498 20.9390 19.1399 15.5976 15.9093 14.9234 7.3704 10.0961 7.4633 0.8983 9.2775 65.2304 19.9898
temp: 298.150 k
press: 1.00000 atm
elementType: 16 8 8 8 7 7 7 6 6 6 6 6 6 6 6 6 6 6 1 1 1 1 1 1 1 1 1 1 1 1 1
symmnumber: 1
zpe: 594006.9 jmol-1
zpe.correction: 0.226245 hartree
zpe.thermalcorrener: 0.245800 hartree
zpe.thermalcorrenthalpy: 0.246744 hartree
zpe.thermalcorrgfe: 0.173898 hartree
zpe.sumelectzpe: -1213.405502 hartree
zpe.sumelectthermal: -1213.385948 hartree
zpe.sumelectthermalent: -1213.385004 hartree
zpe.sumelectthermalfe: -1213.457850 hartree
dipole: -5.6035 3.2808 -2.0504
dipole: 6.8094
quadrupole: -112.4799 -129.2548 -110.8389
quadrupole: -19.1010 -4.0700 3.6971
quadrupole: 5.0446 -11.7302 6.6857 -19.1010 -4.0700 3.6971
hfenergy: -1213.6317478 hartree
pointgroup: C01[X(C11H13N3O3S1)]
dipole: 2.4031871 -0.8139292 -0.8598151 debye
polarizability: 225.1453435|-5.7005514|209.3378265|-16.4339171|-20.6982725|139.6350202 unknown
InChI: InChI=1S/C11H13N3O3S/c1-8-3-5-10(6-4-8)18(16,17)14-9(2)11(15)7-13-12/h3-7,9,14H,1-2H3
charge 0 multiplicity 1
31 atoms
S  -0.432719 1.81935 0.070157
O  -0.798039 2.213916 1.611547
O  -0.493678 2.886865 -1.160049
O  -4.062158 -1.722838 1.327025
N  -1.593872 0.370089 -0.396164
N  -2.0310 -3.549177 0.478904
N  -2.209223 -4.699255 0.663532
C  -2.698296 0.175093 0.573657
C  1.267084 1.018143 0.072482
C  -3.987981 0.954293 0.234411
C  2.022614 1.073486 -1.108562
C  1.722561 0.421923 1.259572
C  -2.987858 -1.347309 0.773166
C  3.813631 -0.144447 0.075533
C  3.305239 0.481064 -1.09336
C  3.00732 -0.162134 1.246175
C  5.203984 -0.751689 0.089486
C  -1.922704 -2.239516 0.313175
H  -2.326424 0.538232 1.558378
H  -1.934428 0.649397 -1.33781
H  -4.783543 0.689161 0.949195
H  -3.79834 2.039938 0.291973
H  -4.348586 0.704092 -0.780858
H  1.632008 1.580273 -1.996844
H  1.106541 0.435771 2.164343
H  3.918718 0.510573 -2.000737
H  3.39027 -0.633131 2.158726
H  5.228235 -1.695596 0.662113
H  5.568239 -0.959515 -0.930792
H  5.927733 -0.062719 0.565843
H  -1.042324 -1.827435 -0.184713
