program: Gaussian 09
title: 000208307
version: EM64L-G09RevD.01
frameworkgroup: C1[X(C13H18O4)]
method: RPBEPBE
basis: SDD
operation: Freq
keyword: #pfreq=noraman
keyword: PBEPBE/SDD
title: #p freq=noraman PBEPBE/SDD
converged: NO NO NO NO
title: Mulliken charges:
elementType: O O O O C C C C C C C C C C C C C H H H H H H H H H H H H H H H H H H
charge: -0.255608 -0.300900 -0.267606 -0.252082 -0.326063 0.299038 -0.320665 -0.078774 -0.092072 -0.230095 -0.217477 -0.145835 -0.772041 -0.330964 -0.307738 -0.296653 -0.343530 0.281415 0.257496 0.264761 0.239259 0.246151 0.239570 0.262687 0.251375 0.226878 0.206770 0.210248 0.233445 0.214179 0.226044 0.222355 0.211374 0.211388 0.233668
chargesum: 0.00000
title: Mulliken charges with hydrogens summed into heavy atoms:
elementType: O O O O C C C C C C C C C C C C C
charge: -0.255608 -0.300900 -0.267606 -0.252082 -0.044648 0.299038 -0.063169 0.185987 0.147187 0.016057 0.022093 0.116852 -0.087018 0.112730 0.132485 0.137076 0.101526
polarizability: 1.53753504e+02 -2.70363481e+00 1.35410620e+02 3.93363584e-01 -5.63286773e-01 1.31453257e+02
1716.lowfreq: -53.5582 -2.3985 0.0004 0.0006 0.0008 10.1649 16.1526 38.1618 51.3140
frequency: -53.3387 38.0566 51.2474 76.1131 117.8694 145.3981 154.9445 168.5316 219.8236 238.1238 252.0567 259.6184 312.9699 367.5991 383.6712 393.4192 450.1195 471.6385 499.2834 566.9973 618.3642 659.0130 668.6422 700.1928 702.8662 732.1182 778.1630 818.4944 836.7770 848.5292 858.6093 866.5978 874.7706 895.4424 917.1665 923.5433 926.8227 940.8289 954.8896 962.4681 965.4031 980.0180 987.0518 999.0561 1015.2053 1036.9101 1066.7506 1078.2415 1091.8951 1100.3938 1105.9538 1110.5844 1117.7397 1140.1134 1160.1946 1161.6149 1180.2801 1185.8363 1190.1030 1197.3569 1226.1390 1235.2805 1262.8663 1269.3288 1281.1741 1302.4392 1313.5734 1316.5824 1319.4379 1320.5222 1327.0924 1331.7155 1366.1315 1379.1343 1470.5081 1473.9833 1475.7940 1480.8888 1485.7159 1492.4976 1579.5064 2976.1671 2982.5130 2983.1750 2997.6961 2999.8741 3003.6450 3010.2026 3061.6827 3062.8529 3065.2801 3090.4527 3092.8996 3093.1875 3095.6338 3103.1044 3105.3650 3161.0544 3192.8192
redmass: 2.2834 3.3945 4.3412 3.7378 5.6879 3.4546 2.9440 3.2988 3.1390 1.2832 2.1000 3.6012 4.5439 4.3200 4.2458 3.9844 3.9258 3.2027 4.9484 3.1225 2.3530 3.5085 2.8888 7.5771 4.2339 3.2483 3.4732 2.2346 2.8669 2.6507 2.5500 2.3924 2.1527 4.0422 3.4715 3.0136 1.5091 3.0262 2.3738 2.1267 5.1905 3.1887 3.1741 2.8020 4.0562 2.1724 2.2383 1.6061 2.0946 1.7190 1.7147 2.3724 2.1767 2.7862 1.1560 1.1538 1.2771 1.1923 1.5941 1.3552 1.4233 1.6064 1.4247 1.2437 1.4185 1.5553 1.2448 1.4509 1.3193 1.4266 1.2503 1.3862 1.3881 1.2072 1.0888 1.0689 1.0719 1.0829 1.0539 1.0863 5.8279 1.0364 1.0666 1.0679 1.0621 1.0839 1.0604 1.0826 1.1052 1.0925 1.0964 1.1001 1.0984 1.0912 1.1017 1.0999 1.0934 1.0879 1.1092
irintensity: 6.0621 5.9600 0.5061 2.1703 3.3734 0.5453 1.4232 3.2714 2.8677 1.8667 1.1913 4.9096 0.7626 7.9119 5.5666 2.4554 11.3138 3.7926 18.4689 8.4280 2.8242 12.1066 3.1436 7.6755 14.4491 59.5260 44.4672 21.6675 7.3836 12.5368 8.2570 8.5226 5.7318 26.5350 50.9661 41.7885 8.5024 2.5219 23.6914 0.4719 25.7149 21.7841 19.1653 10.4999 37.5112 89.5086 104.2363 22.1263 38.9030 17.8936 10.6122 16.4267 19.7393 23.0541 0.4272 0.7413 1.3263 9.2251 11.2007 22.0613 4.2989 59.6320 46.4442 8.2858 3.2781 27.0205 0.7497 6.6148 0.9793 3.1306 1.4852 3.1519 23.8694 16.7699 5.9681 5.1525 1.9347 5.1579 5.3558 2.1908 1.9677 37.9541 38.7439 58.5369 71.5728 15.3565 62.9996 35.8434 15.3780 16.1922 44.4086 24.8689 23.4312 28.0647 49.8823 27.1190 19.5265 5.3095 18.3578
temp: 298.150 k
press: 1.00000 atm
elementType: 8 8 8 8 6 6 6 6 6 6 6 6 6 6 6 6 6 1 1 1 1 1 1 1 1 1 1 1 1 1 1 1 1 1 1
symmnumber: 1
zpe: 761485.3 jmol-1
zpe.correction: 0.290034 hartree
zpe.thermalcorrener: 0.304499 hartree
zpe.thermalcorrenthalpy: 0.305443 hartree
zpe.thermalcorrgfe: 0.248364 hartree
zpe.sumelectzpe: -805.675553 hartree
zpe.sumelectthermal: -805.661088 hartree
zpe.sumelectthermalent: -805.660144 hartree
zpe.sumelectthermalfe: -805.717223 hartree
dipole: -1.0779 -2.9809 0.9671
dipole: 3.3140
quadrupole: -92.5312 -92.1463 -104.4387
quadrupole: -0.2747 -0.9465 0.4079
quadrupole: 3.8409 4.2258 -8.0666 -0.2747 -0.9465 0.4079
hfenergy: -805.9655871 hartree
pointgroup: C01 [X(C13H18O4)]
dipole: 0.3897235 0.2176064 -1.2250591 debye
polarizability: 153.8719433|0.3926071|131.3815372|2.2710291|0.0542294|135.3639007 unknown
InChI: InChI=1S/C13H18O4/c1-8-9-2-3-10(13(9)16-6-7-17-13)11(8)12-14-4-5-15-12/h2-3,8-12H,4-7H2,1H3
charge 0 multiplicity 1
35 atoms
O  2.95493 -0.67549 0.127039
O  1.585391 0.589895 -1.312799
O  -2.586304 -1.586574 -0.164725
O  -3.162587 0.601513 0.454324
C  0.393179 -1.005556 0.236746
C  1.626147 -0.055797 0.01418
C  1.290029 0.859461 1.236404
C  -0.749268 0.072485 0.094184
C  -0.185596 1.319952 0.881144
C  0.585468 -1.32083 1.719737
C  1.141075 -0.220554 2.309801
C  -2.110093 -0.416133 0.601003
C  -0.289399 2.645435 0.101686
C  3.470957 -0.820626 -1.249422
C  2.918646 0.436053 -1.941287
C  -3.508093 -1.0831 -1.214276
C  -3.659985 0.439623 -0.928105
H  0.295436 -1.856678 -0.450954
H  1.997109 1.676573 1.439728
H  -0.835395 0.32466 -0.980473
H  -0.742482 1.433856 1.830826
H  0.303852 -2.262702 2.196262
H  1.389695 -0.082181 3.364844
H  -2.087096 -0.69701 1.667397
H  0.262066 2.58832 -0.85228
H  -1.350507 2.873034 -0.111183
H  0.122494 3.483829 0.695075
H  3.081968 -1.746538 -1.717963
H  4.569107 -0.85724 -1.182627
H  3.541238 1.326235 -1.729486
H  2.760389 0.325814 -3.026042
H  -4.459031 -1.632859 -1.105658
H  -3.079299 -1.277797 -2.214461
H  -3.063522 1.052177 -1.63237
H  -4.705823 0.783845 -0.933967
