program: Gaussian 09
title: 000208304
version: EM64L-G09RevD.01
frameworkgroup: C1[X(C12H18O4)]
method: RPBEPBE
basis: SDD
operation: Freq
keyword: #pfreq=noraman
keyword: PBEPBE/SDD
title: #p freq=noraman PBEPBE/SDD
converged: YES YES NO NO
title: Mulliken charges:
elementType: O O O O C C C C C C C C C C C C H H H H H H H H H H H H H H H H H H
charge: -0.286743 -0.261271 -0.256555 -0.261020 -0.336065 -0.067675 -0.284036 0.273329 -0.496077 -0.235780 -0.209052 -0.137529 -0.329144 -0.322891 -0.531766 -0.538016 0.279944 0.278569 0.257730 0.236938 0.238770 0.250758 0.264021 0.237610 0.230575 0.211603 0.212342 0.229561 0.226842 0.210798 0.237805 0.220036 0.228128 0.228260
chargesum: 0.00000
title: Mulliken charges with hydrogens summed into heavy atoms:
elementType: O O O O C C C C C C C C C C C C
charge: -0.286743 -0.261271 -0.256555 -0.261020 -0.056121 0.210895 -0.026306 0.273329 -0.020369 0.014979 0.028558 0.126493 0.113034 0.119012 0.143678 0.138408
polarizability: 1.42958082e+02 -4.42738566e+00 1.27305898e+02 -3.38702213e+00 -5.54192705e-01 1.23249348e+02
1716.lowfreq: -46.4900 -17.8538 -12.6754 -6.9146 -0.0005 -0.0004 -0.0002 42.2255 65.1113
frequency: -45.8370 42.1348 65.1069 89.2706 103.4425 124.5456 138.7072 154.5420 164.0967 178.0678 207.8712 266.9817 298.3359 321.6522 355.1065 393.6673 415.0087 428.6794 475.7443 498.8584 575.8688 628.9088 682.4451 689.7269 717.7964 736.0777 797.4720 816.7994 827.9593 838.8389 857.4270 874.7382 890.6464 924.7450 927.9329 935.0499 948.2511 954.9249 962.5126 968.7957 987.0094 1007.3895 1023.5862 1038.8332 1064.9226 1080.5361 1087.5515 1108.3694 1111.1176 1120.3849 1123.9146 1147.2135 1155.7896 1164.8440 1170.1980 1183.4338 1185.3340 1193.1018 1226.3045 1255.7692 1264.7251 1270.1745 1285.5422 1293.4522 1306.1667 1318.4720 1320.6923 1355.8305 1418.6363 1428.9581 1459.0410 1464.2174 1467.1740 1476.6264 1481.8895 1485.2543 1493.9654 1585.2899 2959.0892 2960.8236 2985.9356 3001.0481 3022.9608 3037.8498 3049.6760 3055.8784 3070.1962 3079.6429 3086.6483 3093.8980 3094.7503 3107.4829 3111.0926 3111.8299 3161.7413 3193.7721
redmass: 1.8124 4.2008 3.6916 3.3287 2.9711 3.1049 3.5718 1.7918 1.4274 1.3594 2.9558 3.9787 4.7841 2.7233 4.4742 4.5125 3.2119 4.0533 3.2833 4.7778 3.2555 5.1004 6.3700 5.8557 2.5842 2.4447 2.7012 3.0208 1.4888 3.3985 2.7565 2.6161 3.7353 2.7851 1.4591 5.3453 3.7455 2.7137 6.0496 2.5919 2.3982 7.2829 4.7417 3.7535 2.2280 2.6651 1.4145 1.5675 1.3801 1.3205 1.5997 1.2967 1.4123 1.1534 1.9042 1.1318 1.4081 1.6858 1.5939 1.2874 1.4747 1.2055 1.5597 1.4678 1.2404 1.3660 1.6932 1.3851 1.1281 1.1439 1.0567 1.0570 1.0826 1.0508 1.0864 1.0525 1.0848 5.8347 1.0320 1.0338 1.0642 1.0646 1.0621 1.0821 1.1027 1.0994 1.1004 1.0913 1.1017 1.1022 1.0923 1.0979 1.0936 1.1017 1.0879 1.1093
irintensity: 1.1878 1.1813 1.8370 1.7535 2.6500 5.7782 5.1229 0.2935 1.3152 1.0380 2.9033 14.3373 4.9329 1.9820 12.5843 14.7483 12.5879 0.0452 2.2307 20.7463 1.3408 3.2268 7.7914 1.3488 25.8963 67.2134 12.9402 29.2535 9.1323 18.2132 15.2095 14.0923 13.3625 35.3819 4.1335 8.6298 6.8137 5.9393 24.7383 17.0959 24.5528 115.0530 72.0386 99.1772 96.9576 46.5878 28.6238 1.3016 5.9463 3.6865 13.1617 9.2219 3.7256 1.5124 2.4657 1.2062 22.5645 0.8562 30.1781 6.6663 43.6673 2.1182 11.4347 17.5818 1.5423 4.8304 6.4386 19.3153 5.5100 7.3878 3.7326 5.1248 11.3895 11.7686 3.0232 11.6429 4.1565 2.5070 80.8593 33.6879 28.7134 87.3523 24.8735 23.4920 32.3937 54.7313 3.7759 14.8111 24.5507 37.0493 61.0623 27.2487 23.1890 14.6291 5.9786 17.4364
temp: 298.150 k
press: 1.00000 atm
elementType: 8 8 8 8 6 6 6 6 6 6 6 6 6 6 6 6 1 1 1 1 1 1 1 1 1 1 1 1 1 1 1 1 1 1
symmnumber: 1
zpe: 742131.9 jmol-1
zpe.correction: 0.282663 hartree
zpe.thermalcorrener: 0.297549 hartree
zpe.thermalcorrenthalpy: 0.298493 hartree
zpe.thermalcorrgfe: 0.240685 hartree
zpe.sumelectzpe: -767.620132 hartree
zpe.sumelectthermal: -767.605246 hartree
zpe.sumelectthermalent: -767.604302 hartree
zpe.sumelectthermalfe: -767.662110 hartree
dipole: 0.5372 2.1573 0.9789
dipole: 2.4292
quadrupole: -92.7463 -91.0233 -92.4186
quadrupole: -2.9025 -3.3828 1.0519
quadrupole: -0.6835 1.0394 -0.3559 -2.9025 -3.3828 1.0519
hfenergy: -767.9027951 hartree
pointgroup: C01 [X(C12H18O4)]
dipole: -0.1842822 0.7768218 -0.5253139 debye
polarizability: 143.2646476|3.4442711|127.2124197|-3.7122535|0.0085997|123.03626 unknown
InChI: InChI=1S/C12H18O4/c1-13-12(14-2)8-3-4-10(12)9(7-8)11-15-5-6-16-11/h3-4,8-11H,5-7H2,1-2H3
charge 0 multiplicity 1
34 atoms
O  -1.501935 1.459246 -0.654874
O  -2.973626 -0.387833 -0.358244
O  3.090435 0.260481 0.975722
O  2.620581 -1.051573 -0.898635
C  -0.405603 -0.735013 -0.466198
C  0.727453 0.153495 0.190313
C  -1.375723 0.012194 1.475219
C  -1.655781 0.131611 -0.065063
C  0.070913 0.630461 1.538188
C  -0.62541 -1.948999 0.434946
C  -1.205951 -1.503987 1.587988
C  2.051248 -0.596229 0.381219
C  3.735599 0.962423 -0.157651
C  3.429415 0.07972 -1.410842
C  -2.474611 2.446417 -0.160438
C  -3.184486 -0.721414 -1.773852
H  -0.247713 -0.924075 -1.53646
H  0.897182 1.024756 -0.466523
H  -2.114912 0.470072 2.148069
H  0.036856 1.732119 1.585266
H  0.621277 0.268835 2.423247
H  -0.309387 -2.967328 0.197379
H  1.952606 -1.479948 1.031342
H  -1.464335 -2.090684 2.472919
H  4.809356 1.024257 0.080945
H  3.321011 1.98267 -0.267683
H  2.863095 0.643732 -2.176504
H  4.331384 -0.358697 -1.867179
H  -2.357709 3.32977 -0.807387
H  -2.258701 2.727079 0.88984
H  -3.504918 2.052948 -0.230898
H  -2.643846 -1.65063 -2.040621
H  -2.855212 0.105043 -2.432098
H  -4.26805 -0.883619 -1.884657
