program: Gaussian 09
title: 000208300
version: EM64L-G09RevD.01
frameworkgroup: C1[X(C10H19NO)]
method: RPBEPBE
basis: SDD
operation: Freq
keyword: #p
keyword: freq=noraman
keyword: PBEPBE/SDD
title: #p freq=noraman PBEPBE/SDD
converged: NO YES NO NO
title: Mulliken charges:
elementType: O N C C C C C C C C C C H H H H H H H H H H H H H H H H H H H
charge: -0.279221 -0.358894 0.040058 -0.430171 -0.446875 -0.026459 -0.123105 -0.505108 0.124957 -0.730737 -0.720180 -0.701046 0.200389 0.188787 0.225109 0.205129 0.194965 0.204176 0.204293 0.205727 0.240586 0.306908 0.233939 0.206542 0.227477 0.204750 0.220933 0.239305 0.213484 0.217142 0.217139
chargesum: 0.00000
title: Mulliken charges with hydrogens summed into heavy atoms:
elementType: O N C C C C C C C C C C
charge: -0.279221 -0.051986 0.240447 -0.016274 -0.046782 0.177717 0.081188 -0.058795 0.124957 -0.062779 -0.055191 -0.053281
polarizability: 1.29923147e+02 3.81487254e+00 1.13907575e+02 -3.86579374e-01 2.87297170e+00 9.87223487e+01
1716.lowfreq: -10.7278 0.0002 0.0006 0.0007 6.5846 11.4043 62.4935 78.6063 109.5857
frequency: 62.0066 78.4962 109.5792 121.0322 164.1922 184.1134 197.8863 215.9342 227.2770 242.4370 306.5105 342.7704 358.4736 368.9645 413.8439 456.9021 465.4791 516.5068 533.7203 565.1631 620.1134 705.7583 750.6721 804.8305 838.6607 856.6162 871.8908 912.2618 930.7457 950.8753 959.7074 971.8325 988.5027 1012.8671 1053.1757 1063.3397 1100.3817 1109.0611 1148.9761 1155.4462 1178.1244 1201.0073 1216.3253 1234.1817 1267.5464 1289.3541 1302.5947 1317.0568 1329.0881 1332.0634 1346.2299 1353.6643 1358.8776 1384.2469 1388.3245 1393.1554 1401.6576 1409.4284 1449.8352 1454.2354 1463.1156 1466.5759 1471.9466 1475.3006 1482.9451 1483.9852 1488.9414 1613.0530 2925.0083 2950.9269 2967.1554 2975.6466 2977.1004 2979.6518 2980.2489 2981.3529 2985.0337 3014.4721 3043.2761 3065.2363 3072.5778 3074.7088 3076.0240 3076.3298 3080.0607 3084.5431 3517.0230
redmass: 3.0070 2.4394 4.7549 2.9191 2.4700 1.2255 1.1541 1.2737 1.9782 2.7029 2.6638 2.3434 2.4535 2.5094 2.4573 2.6212 3.4406 1.9397 2.1078 2.3699 1.8234 3.0194 3.1860 2.4817 3.1450 2.1334 2.0652 1.2043 1.8635 1.4763 1.7465 1.9640 1.8863 1.8895 1.7584 1.6273 2.0540 1.8234 1.9346 1.9758 1.7775 1.3287 1.5119 1.3721 1.3404 1.5330 1.2922 1.5224 1.5175 1.4315 1.4392 1.4112 1.4019 1.2303 2.6759 1.2466 1.2942 1.4332 1.0928 1.0824 1.0813 1.0488 1.0500 1.0545 1.0553 1.0594 1.0559 5.1970 1.0835 1.0667 1.0734 1.0569 1.0464 1.0445 1.0406 1.0753 1.0628 1.0985 1.1001 1.0982 1.0986 1.0995 1.0982 1.0976 1.0982 1.0992 1.0754
irintensity: 0.3314 0.1898 1.1599 0.4187 1.4262 0.0630 0.3900 0.0572 0.4977 0.2170 1.7074 0.0293 0.7252 1.7829 1.0459 4.6204 4.5295 24.5713 4.9616 14.4466 48.7789 28.5034 3.5780 2.6258 2.0233 3.5921 3.1404 2.2925 2.6700 1.0084 1.5327 1.5500 0.6616 4.5721 7.6916 0.9752 2.0585 12.4339 1.8486 27.9754 10.6849 19.5051 2.6673 9.2139 0.4950 21.5727 1.3028 6.7407 18.4308 20.4586 5.5874 4.9410 3.5971 17.6808 87.5799 33.5047 34.3402 2.5578 19.0654 10.0499 6.9925 0.0424 5.8476 15.6196 9.7440 3.1992 15.4470 354.2020 27.3084 13.9836 56.3472 10.1494 34.2390 50.3120 23.0113 29.7503 24.8455 46.6226 43.2049 14.2505 62.7479 42.1352 41.4854 16.5494 52.3629 36.7312 15.1884
temp: 298.150 k
press: 1.00000 atm
elementType: 8 7 6 6 6 6 6 6 6 6 6 6 1 1 1 1 1 1 1 1 1 1 1 1 1 1 1 1 1 1 1
symmnumber: 1
zpe: 724436.0 jmol-1
zpe.correction: 0.275923 hartree
zpe.thermalcorrener: 0.289269 hartree
zpe.thermalcorrenthalpy: 0.290213 hartree
zpe.thermalcorrgfe: 0.237062 hartree
zpe.sumelectzpe: -521.480837 hartree
zpe.sumelectthermal: -521.467492 hartree
zpe.sumelectthermalent: -521.466548 hartree
zpe.sumelectthermalfe: -521.519699 hartree
dipole: -2.1597 -4.1358 -1.3701
dipole: 4.8627
quadrupole: -71.2535 -86.6945 -74.4825
quadrupole: -5.7962 -3.0063 -2.4390
quadrupole: 6.2233 -9.2177 2.9943 -5.7962 -3.0063 -2.4390
hfenergy: -521.7567606 hartree
pointgroup: C01 [X(C10H19N1O1)]
dipole: 0.9048865 -1.585927 0.5710248 debye
polarizability: 130.1571487|-3.2898037|113.5395817|-0.310268|-3.1969574|98.8563399 unknown
InChI: InChI=1S/C10H19NO/c1-7(2)9-5-4-8(3)6-10(12)11-9/h7-9,11H,4-6H2,1-3H3
charge 0 multiplicity 1
31 atoms
O  -1.252134 2.4790 -0.617881
N  0.372283 0.889035 -0.203557
C  0.939964 -0.340204 0.395637
C  0.19873 -1.618078 -0.084639
C  -1.166333 -1.849684 0.607858
C  -2.261807 -0.772239 0.371106
C  2.475827 -0.396018 0.121742
C  -1.850886 0.640375 0.893078
C  -0.899349 1.409108 -0.02636
C  -2.743008 -0.722819 -1.098381
C  2.831868 -0.487561 -1.383445
C  3.221007 0.779412 0.800239
H  0.819386 -0.279121 1.50099
H  0.844173 -2.494653 0.127618
H  0.070842 -1.573513 -1.182304
H  -1.568557 -2.82864 0.276438
H  -0.992139 -1.938853 1.701268
H  -3.128916 -1.081373 0.992811
H  2.821269 -1.334648 0.601976
H  -1.405714 0.537633 1.903808
H  -2.747793 1.275755 0.985596
H  0.963796 1.432811 -0.837645
H  -1.935771 -0.410738 -1.784951
H  -3.103578 -1.716266 -1.423901
H  -3.569807 0.000093 -1.219595
H  2.548816 0.427923 -1.937212
H  3.922695 -0.613274 -1.507165
H  2.336499 -1.343888 -1.873416
H  2.927451 1.755502 0.370981
H  4.313551 0.674172 0.67035
H  3.008632 0.816654 1.884757
