program: Gaussian 09
title: 000208299
version: EM64L-G09RevD.01
frameworkgroup: C1[X(C14H16N2O)]
method: RPBEPBE
basis: SDD
operation: Freq
keyword: #p
keyword: freq=noraman
keyword: PBEPBE/SDD
title: #p freq=noraman PBEPBE/SDD
converged: NO YES NO NO
title: Mulliken charges:
elementType: O N N C C C C C C C C C C C C C C H H H H H H H H H H H H H H H H
charge: -0.263955 -0.240053 -0.037828 0.129125 0.206880 0.244492 0.048876 -0.582383 -0.529430 0.316812 -0.390887 0.044523 -0.647106 -0.332782 -0.399050 -0.762240 -0.537780 0.241862 0.241802 0.224279 0.224587 0.228918 0.253185 0.238298 0.238366 0.230685 0.232491 0.215765 0.266314 0.215818 0.242525 0.218914 0.218975
chargesum: 0.00000
title: Mulliken charges with hydrogens summed into heavy atoms:
elementType: O N N C C C C C C C C C C C C C C
charge: -0.263955 -0.240053 -0.037828 0.129125 0.206880 0.244492 0.048876 -0.098719 -0.080564 0.316812 -0.161969 0.044523 0.082744 -0.102096 -0.166558 -0.064343 0.142634
polarizability: 2.22125725e+02 -5.08467266e+00 1.89083466e+02 6.20412632e-02 -5.17643675e-03 8.75937940e+01
1716.lowfreq: -91.6742 -13.8409 -7.7131 -1.8869 0.0003 0.0006 0.0007 38.9792 81.9755
frequency: -91.6728 38.8518 81.9631 105.4027 129.7184 136.4943 161.2239 189.7869 217.6917 231.4304 235.1490 268.5460 284.3460 290.8814 310.7938 317.1851 367.5376 430.9871 482.5408 512.0208 516.9329 549.6587 577.2158 592.6243 601.4711 635.9927 639.8351 682.4363 774.4910 776.4109 783.4174 809.0745 828.1641 896.5355 944.0516 948.4956 954.6590 955.3376 980.0809 1000.8387 1037.4756 1052.0671 1076.0039 1099.8876 1113.9886 1114.2609 1121.6323 1148.5590 1172.9433 1181.0629 1185.1050 1196.4647 1243.6687 1278.0502 1296.1598 1308.0791 1339.4286 1359.0706 1381.2749 1384.4399 1406.1990 1431.6771 1441.2594 1450.6510 1456.3927 1460.6279 1461.3031 1467.2549 1468.7392 1471.4364 1474.3619 1486.7746 1498.3286 1553.0395 1582.2727 1617.0277 1679.6563 2921.0994 2946.7681 2953.7319 2959.0862 2978.4956 2992.8716 2996.4752 3039.3038 3058.1395 3078.3081 3110.1321 3113.3935 3122.8183 3128.2983 3141.1572 3154.6898
redmass: 1.1015 3.6323 2.7074 2.9375 3.6100 4.2841 2.6445 1.5950 1.2264 1.7139 3.3836 3.8984 1.9078 3.0031 4.1156 3.7482 4.1187 5.0496 2.5270 4.3763 3.3274 4.4931 6.1084 4.3535 5.6989 4.2046 4.9008 5.3852 5.1238 5.0641 1.3511 4.9713 1.3447 3.5768 1.3790 2.0148 4.5163 1.7843 2.0463 5.5837 1.5329 2.0483 1.7872 2.6107 1.2996 1.2693 1.9380 1.7263 2.5528 1.0934 1.0852 3.0407 2.0851 2.1966 2.5998 2.0213 3.3910 2.8482 1.6644 1.6103 2.3671 1.2092 2.6439 2.5678 1.1881 1.1178 1.0507 1.0468 1.5640 1.4071 1.0526 1.0456 1.0911 8.6867 7.7374 7.8033 6.6361 1.0583 1.0987 1.0333 1.0589 1.0377 1.0987 1.0350 1.1035 1.0982 1.1017 1.0977 1.0980 1.0992 1.0870 1.0901 1.0982
irintensity: 0.0013 0.0394 0.8875 0.3011 1.3135 0.1984 15.9390 1.0129 0.0045 3.8580 2.5571 0.4384 1.4966 3.9330 3.3474 1.4331 2.6811 0.0587 2.1863 1.5989 0.5749 5.6482 1.1053 6.7068 3.1772 1.5957 2.0049 8.5021 0.1875 0.1444 46.0645 10.1388 40.0953 3.5613 0.0275 8.0563 16.2690 1.2746 0.2178 15.0171 3.5126 13.5964 6.7216 8.1260 0.4966 0.1663 42.6654 52.8035 148.7183 0.0007 0.0419 4.9089 3.7502 11.8927 2.5783 42.0632 19.1843 32.8700 1.6431 55.2719 22.8176 8.5615 3.9851 14.0958 11.8622 12.9768 13.6226 0.3115 27.1131 31.8623 21.1620 30.8722 7.5033 45.0658 37.8224 9.4440 49.0534 64.7153 21.9882 61.2691 33.5213 10.5177 13.2954 79.8251 51.3295 11.9614 34.2636 22.3615 1.8343 26.9903 11.0867 28.3523 35.1650
temp: 298.150 k
press: 1.00000 atm
elementType: 8 7 7 6 6 6 6 6 6 6 6 6 6 6 6 6 6 1 1 1 1 1 1 1 1 1 1 1 1 1 1 1 1
symmnumber: 1
zpe: 708378.7 jmol-1
zpe.correction: 0.269807 hartree
zpe.thermalcorrener: 0.284765 hartree
zpe.thermalcorrenthalpy: 0.285709 hartree
zpe.thermalcorrgfe: 0.228205 hartree
zpe.sumelectzpe: -726.562846 hartree
zpe.sumelectthermal: -726.547888 hartree
zpe.sumelectthermalent: -726.546944 hartree
zpe.sumelectthermalfe: -726.604448 hartree
dipole: -3.8679 4.4077 0.0039
dipole: 5.8642
quadrupole: -99.2955 -89.1266 -103.7188
quadrupole: 4.9018 -0.0257 0.0098
quadrupole: -1.9152 8.2537 -6.3385 4.9018 -0.0257 0.0098
hfenergy: -726.8326531 hartree
pointgroup: C01 [X(C14H16N2O1)]
dipole: 1.5929137 -1.6660207 -0.0998527 debye
polarizability: 222.1693907|-3.5524123|188.6840697|-6.7282099|1.5765661|87.949525 unknown
InChI: InChI=1S/C14H16N2O/c1-9-14-11(6-7-15-9)12-8-10(17-3)4-5-13(12)16(14)2/h4,6-7H,5,8H2,1-3H3
charge 0 multiplicity 1
33 atoms
O  4.103906 1.176145 -0.268743
N  -0.892403 -1.392543 -0.063416
N  -3.73512 1.090532 0.115544
C  0.456639 0.464602 -0.105846
C  0.436895 -0.927634 -0.123825
C  -0.91263 0.905988 -0.031462
C  -1.749307 -0.271365 -0.005268
C  1.72301 1.275054 -0.156322
C  1.649101 -1.81243 -0.19559
C  2.944332 0.379217 -0.225597
C  2.925092 -0.98498 -0.243488
C  -3.166808 -0.149844 0.069512
C  -1.281639 -2.807275 -0.061752
C  -1.534923 2.180651 0.017681
C  -2.937005 2.21223 0.089728
C  -4.13665 -1.318641 0.10528
C  5.392692 0.486218 -0.337896
H  1.735264 1.955909 -1.032377
H  1.819088 1.933474 0.73165
H  1.687237 -2.500611 0.678214
H  1.60293 -2.473009 -1.09005
H  3.859808 -1.554276 -0.294663
H  -0.37611 -3.430698 -0.115421
H  -1.827014 -3.072821 0.860477
H  -1.91713 -3.050285 -0.930938
H  -0.951754 3.107335 0.001026
H  -3.476616 3.164932 0.130454
H  -3.973095 -1.970525 0.98354
H  -5.15587 -0.906047 0.164051
H  -4.067157 -1.948542 -0.801212
H  6.149224 1.284289 -0.363552
H  5.464737 -0.132975 -1.254077
H  5.549672 -0.155276 0.551936
