program: Gaussian 09
title: 000208295
version: EM64L-G09RevD.01
frameworkgroup: C1[X(C18H22I3N3O5)]
method: RPBEPBE
basis: SDD
operation: Freq
keyword: #p
keyword: freq=noraman
keyword: PBEPBE/SDD
title: #p freq=noraman PBEPBE/SDD
converged: NO YES NO NO
title: Mulliken charges:
elementType: I I I O O O O O N N N C C C C C C C C C C C C C C C C C C H H H H H H H H H H H H H H H H H H H H H H
charge: 0.188594 0.202439 0.182983 -0.216039 -0.258766 -0.259775 -0.413803 -0.213288 -0.266582 -0.267362 -0.087531 0.721490 0.731061 0.556194 -0.737026 -0.788672 -0.772769 0.060049 0.214483 0.213323 -0.626728 -0.626927 -0.454410 -0.456011 -0.449966 -0.610845 -0.676198 -0.681079 0.223345 0.281196 0.241000 0.244427 0.240262 0.244936 0.281455 0.241203 0.235440 0.243206 0.240133 0.274450 0.286557 0.273982 0.221933 0.277662 0.233842 0.235458 0.207769 0.240745 0.228788 0.206486 0.388883
chargesum: 0.00000
title: Mulliken charges with hydrogens summed into heavy atoms:
elementType: I I I O O O O O N N N C C C C C C C C C C C C C C C C C C
charge: 0.188594 0.202439 0.182983 -0.216039 -0.258766 -0.259775 -0.024920 -0.213288 -0.266582 -0.267362 -0.087531 0.721490 0.731061 0.556194 -0.737026 -0.788672 -0.772769 0.060049 0.214483 0.213323 0.139896 0.139726 0.022233 0.027329 0.111041 0.162731 0.000871 -0.005060 0.223345
polarizability: 3.59035091e+02 6.08311211e+00 3.55952435e+02 -1.18638673e+01 4.33971432e+00 2.33540072e+02
1716.lowfreq: -14.4111 -6.6816 -5.4318 -0.0005 -0.0004 -0.0001 6.0078 13.5472 17.7886
frequency: -13.6666 12.2750 17.7391 19.1138 25.4855 30.0547 36.0282 45.1694 51.5945 54.1478 63.7493 75.3506 79.2538 83.0371 91.0506 92.0351 107.8762 112.7252 115.4026 120.2626 126.8515 132.3201 148.9864 155.3212 162.6987 181.0379 186.7422 191.0990 195.5453 197.0848 202.5836 235.5464 254.8704 291.2805 295.4965 316.2798 332.1536 342.9958 349.7161 372.1760 377.3358 382.5964 392.1162 434.7560 460.1418 473.7690 483.9938 488.9955 523.9296 534.5686 548.7700 582.2919 592.9681 644.0857 647.4097 653.8231 679.3819 687.9612 706.6638 723.2709 773.4991 777.0423 794.8082 800.2346 801.5241 841.3611 874.0237 933.6850 935.1860 974.5554 1009.2924 1016.2021 1017.3126 1034.0547 1038.4914 1055.8387 1077.6401 1079.1593 1097.7910 1111.0151 1114.9015 1122.9443 1124.8562 1127.0969 1141.1925 1185.8546 1199.6153 1251.9223 1256.9776 1258.0434 1263.5398 1270.1042 1274.5259 1290.4618 1298.5253 1337.4463 1337.9249 1353.7060 1361.1829 1368.8401 1394.6686 1396.2473 1396.5437 1418.9427 1420.8292 1425.1040 1434.9431 1436.9590 1440.4167 1467.6656 1468.2691 1475.2419 1475.7913 1478.2442 1479.0206 1479.4586 1483.1323 1484.2381 1493.5302 1503.2112 1507.9711 1584.7774 1612.3765 1613.5850 1681.0192 2973.1213 2975.1685 2979.4730 2982.9177 2983.7902 2984.0538 2997.5398 2999.4175 3024.3703 3024.7540 3069.9627 3070.2013 3079.2519 3092.8092 3092.9801 3095.8066 3105.8126 3106.2294 3112.5126 3113.3520 3128.2107 3512.3382
redmass: 4.9938 2.6812 2.4796 7.8214 6.0562 5.8960 9.6706 5.8552 8.7853 6.9155 6.4041 6.6463 2.8774 2.6672 17.7778 14.2923 5.8659 1.0807 3.7255 1.4338 1.1574 3.7200 2.5841 2.2364 98.1791 3.8678 4.0640 1.4282 1.4843 3.7281 3.6586 3.3979 4.3719 5.4478 3.7534 5.4937 5.4867 4.6659 4.4543 3.2432 5.3420 5.7232 6.3820 5.4905 5.8365 4.6692 2.3944 9.0543 5.5434 2.8499 3.1354 4.4879 7.4495 1.4522 3.9721 4.1948 8.7723 8.6721 5.8655 10.8952 9.4206 5.0697 6.1423 1.3838 1.3705 4.8151 3.7468 3.1145 3.5895 3.0165 2.0841 1.6572 6.4165 2.1195 2.5925 2.2057 1.6041 1.5971 2.5025 2.4891 2.0547 1.3705 1.3112 1.3032 2.2867 5.7553 1.6520 2.4402 1.1818 1.1719 2.2040 2.8554 2.8787 8.4349 5.4405 2.6257 2.5000 1.6674 4.2605 4.0930 1.2115 1.2713 2.0712 1.2663 1.2471 1.2871 1.0917 1.1163 1.0901 1.0392 1.0389 1.0793 1.1075 1.0660 1.0614 1.0558 1.0493 1.0587 1.0951 9.2588 9.7415 8.8746 7.9022 7.9365 8.7316 1.0603 1.0595 1.0685 1.0335 1.0337 1.0379 1.0366 1.0364 1.0987 1.0986 1.1026 1.1026 1.0972 1.1002 1.0909 1.1001 1.1000 1.1003 1.0992 1.0992 1.1002 1.0643
irintensity: 0.4270 0.1378 0.1627 0.5045 0.1875 0.5098 0.2675 1.6905 0.4584 0.5250 0.9715 0.2447 1.6815 2.0922 0.2306 0.2304 0.5769 0.7443 0.9862 1.0293 1.2782 1.6097 2.0582 2.1089 0.0217 3.7642 1.0488 0.4240 2.9229 0.9809 0.0698 1.2267 4.2720 2.8459 0.9052 2.1546 11.6780 6.6541 2.7796 0.9853 0.8220 20.1360 23.0833 2.5559 13.9254 4.2146 33.4442 8.7259 13.5627 0.2290 17.9830 32.8875 4.0842 135.5252 26.7700 3.1146 8.8234 0.0575 7.2645 0.8932 2.4658 18.4825 8.7741 6.6000 12.1509 1.0122 1.3221 13.9287 7.7527 18.2386 1.2069 2.4957 26.2515 80.5458 177.6257 84.9289 0.3534 0.1521 41.4510 34.5741 41.1341 17.4141 9.8170 7.2060 138.4460 78.2625 102.8177 4.2243 0.3617 0.5493 16.6909 130.9545 5.8154 0.6955 1.7634 25.4612 41.0857 34.3522 202.7512 140.9939 26.0318 26.1769 40.0810 82.9468 72.3938 98.8056 29.5467 13.4577 8.5585 5.8295 16.7841 21.4018 19.3307 14.2135 1.8158 27.2268 6.8390 23.1696 17.4199 10.5676 8.9504 260.6792 353.9786 152.7418 169.5102 29.6259 33.5197 18.2853 24.5342 68.8052 42.0743 26.7737 29.5506 8.9452 0.9105 8.1205 20.2812 9.2356 24.0020 2.7396 22.7656 16.1844 25.9300 0.1574 0.1460 0.2706 30.0992
temp: 298.150 k
press: 1.00000 atm
elementType: 53 53 53 8 8 8 8 8 7 7 7 6 6 6 6 6 6 6 6 6 6 6 6 6 6 6 6 6 6 1 1 1 1 1 1 1 1 1 1 1 1 1 1 1 1 1 1 1 1 1 1
symmnumber: 1
zpe: 989674.2 jmol-1
zpe.correction: 0.376947 hartree
zpe.thermalcorrener: 0.410904 hartree
zpe.thermalcorrenthalpy: 0.411848 hartree
zpe.thermalcorrgfe: 0.303746 hartree
zpe.sumelectzpe: -1271.841052 hartree
zpe.sumelectthermal: -1271.807096 hartree
zpe.sumelectthermalent: -1271.806152 hartree
zpe.sumelectthermalfe: -1271.914254 hartree
dipole: 1.9573 -1.8925 3.0419
dipole: 4.0824
quadrupole: -229.8769 -228.6206 -206.0219
quadrupole: -13.2186 18.3236 -7.4890
quadrupole: -8.3705 -7.1141 15.4845 -13.2186 18.3236 -7.4890
hfenergy: -1272.2179995 hartree
pointgroup: C01 [X(C18H22I3N3O5)]
dipole: -0.9386793 0.7125222 1.0912768 debye
polarizability: 354.0773206|6.8301383|356.5447434|25.709487|-4.0787369|237.9055345 unknown
InChI: InChI=1S/C18H22I3N3O5/c1-6-9(25)23(4)16-13(19)12(18(29)22(3)8-11(27)28)14(20)17(15(16)21)24(5)10(26)7-2/h27H,6-8H2,1-5H3
charge 0 multiplicity 1
51 atoms
I  3.429278 -1.784739 -0.261348
I  -2.58871 -1.725768 -1.505388
I  0.469408 3.580082 -0.762412
O  -2.226193 1.80302 -2.702084
O  4.445603 2.418972 1.05124
O  0.1765 -4.897739 0.16797
O  -3.067278 0.057907 2.696362
O  -4.746312 0.288943 1.101465
N  2.886268 1.432743 -0.365627
N  0.40466 -2.841675 -0.896323
N  -2.880153 1.940468 -0.461661
C  1.656856 0.730864 -0.577191
C  0.415278 -1.411149 -0.855681
C  -0.777738 0.755866 -1.082358
C  1.618083 -0.692285 -0.606653
C  -0.769774 -0.661138 -1.103866
C  0.440118 1.430874 -0.81736
C  -2.025727 1.536631 -1.480345
C  3.352657 1.799979 0.916222
C  0.169838 -3.636802 0.24722
C  3.685746 1.773325 -1.565113
C  0.660489 -3.48992 -2.20296
C  2.461778 1.408231 2.101758
C  -0.082107 -2.883322 1.559159
C  -2.646602 1.637006 0.948861
C  -4.074817 2.741153 -0.801249
C  3.059798 1.85314 3.447714
C  -0.476188 -3.831841 2.704773
C  -3.621442 0.605054 1.531979
H  4.575986 2.320114 -1.216478
H  4.003017 0.857709 -2.096251
H  3.104552 2.414232 -2.251927
H  1.665836 -3.227739 -2.578767
H  -0.101723 -3.187897 -2.943246
H  0.603166 -4.577854 -2.040828
H  2.313168 0.310087 2.091445
H  1.458833 1.858043 1.95768
H  -0.869683 -2.120459 1.401615
H  0.840128 -2.326475 1.82304
H  -2.750941 2.559386 1.556651
H  -1.620813 1.270313 1.106895
H  -4.989536 2.203826 -0.500584
H  -4.032777 3.720412 -0.286892
H  -4.079853 2.901656 -1.889569
H  3.199015 2.946887 3.474229
H  4.05046 1.395395 3.607626
H  2.394927 1.558883 4.279514
H  0.300359 -4.597979 2.864899
H  -1.413973 -4.364171 2.470269
H  -0.614713 -3.264018 3.642419
H  -3.711053 -0.579834 3.109754
