program: Gaussian 09
title: 000208268
version: EM64L-G09RevD.01
frameworkgroup: C1[X(C6H11N2O3PS2)]
method: RPBEPBE
basis: SDD
operation: Freq
keyword: #p
keyword: freq=noraman
keyword: PBEPBE/SDD
title: #p freq=noraman PBEPBE/SDD
converged: YES YES NO NO
title: Mulliken charges:
elementType: S S P O O O N N C C C C C C H H H H H H H H H H H
charge: 0.071180 -0.221422 0.587063 -0.234988 -0.476235 -0.450587 -0.142465 -0.121761 -0.791935 0.343121 0.246377 -0.744929 -0.495593 -0.476395 0.338170 0.302990 0.263416 0.254411 0.251644 0.241323 0.292483 0.234143 0.239875 0.246641 0.243474
chargesum: 0.00000
title: Mulliken charges with hydrogens summed into heavy atoms:
elementType: S S P O O O N N C C C C C C
charge: 0.071180 -0.221422 0.587063 -0.234988 -0.476235 -0.450587 -0.142465 -0.121761 -0.150776 0.343121 0.246377 0.024542 0.272355 0.253595
polarizability: 2.18341498e+02 -1.16227689e+01 1.29737988e+02 -7.38152100e+00 2.78101192e+00 1.23456037e+02
1716.lowfreq: -2.5206 -0.0021 -0.0011 0.0023 2.8479 14.4244 25.7213 35.9896 43.7667
frequency: 25.4654 35.8884 43.7503 72.6396 86.6469 109.2208 111.7358 115.9657 121.3964 132.5151 142.8193 151.1266 170.7124 218.5538 242.0698 258.7218 268.9156 311.3726 354.7504 374.6929 376.8269 419.4328 534.5811 583.1045 630.6223 637.3648 638.9168 677.4141 705.5911 738.3164 831.5662 876.0579 898.1817 941.9360 946.5806 956.4439 1015.6645 1050.3377 1099.4746 1107.3900 1126.1590 1128.3609 1140.1723 1180.8293 1258.7905 1304.7017 1402.6198 1416.2049 1420.3112 1431.4405 1453.7368 1455.6430 1455.8524 1462.3935 1468.6871 1477.5890 1496.3015 1531.7187 2979.9739 2986.3340 3002.7706 3056.1623 3085.0431 3092.0006 3093.6634 3123.0131 3131.7290 3133.4701 3140.0931
redmass: 6.7762 5.1067 5.3926 3.5403 4.4559 1.8680 1.7773 1.4451 1.8948 2.6011 1.6603 4.0473 5.4490 4.9339 6.5136 2.7313 5.9603 6.3805 8.4429 5.7436 2.8454 8.2630 16.6341 7.3328 5.1919 10.6792 6.5047 12.3500 7.0529 7.6982 2.2568 6.9405 8.6453 11.3164 3.1066 11.2651 2.6418 1.4866 2.4489 1.2425 1.2593 1.2775 1.2817 1.7354 1.1736 2.8415 1.2264 1.1177 1.1207 1.1151 1.0505 1.0701 1.1698 1.0477 1.0525 1.0519 7.1414 5.6421 1.0296 1.0295 1.0377 1.0586 1.0982 1.1051 1.1056 1.1043 1.0987 1.1034 1.1076
irintensity: 0.5669 2.0128 6.0128 4.4492 1.5752 1.4689 1.0745 0.6754 3.0240 1.5208 1.9710 0.2162 5.0207 5.6504 16.5745 4.1491 9.2243 7.2956 0.2035 9.5958 1.0698 31.9700 144.8054 2.6508 11.1940 81.3293 1.8391 111.9158 8.1030 30.3941 3.3726 17.1072 30.8475 194.2655 6.8365 103.2484 4.3488 5.6337 11.0072 0.2035 0.9327 1.6411 0.7149 13.6471 2.5114 23.5490 11.9278 14.4101 1.9433 11.4745 18.2584 21.8177 25.0832 4.5904 16.5379 12.4184 38.8515 52.2473 39.6167 47.5993 7.5320 6.7133 6.7313 22.1816 1.2223 8.5802 2.7669 11.0879 5.1524
temp: 298.150 k
press: 1.00000 atm
elementType: 16 16 15 8 8 8 7 7 6 6 6 6 6 6 1 1 1 1 1 1 1 1 1 1 1
symmnumber: 1
zpe: 463257.0 jmol-1
zpe.correction: 0.176445 hartree
zpe.thermalcorrener: 0.194256 hartree
zpe.thermalcorrenthalpy: 0.195201 hartree
zpe.thermalcorrgfe: 0.128245 hartree
zpe.sumelectzpe: -1706.615315 hartree
zpe.sumelectthermal: -1706.597504 hartree
zpe.sumelectthermalent: -1706.596559 hartree
zpe.sumelectthermalfe: -1706.663515 hartree
dipole: 2.0471 -1.4385 -2.0395
dipole: 3.2279
quadrupole: -84.5976 -108.0450 -107.8380
quadrupole: -7.3283 13.9036 2.7020
quadrupole: 15.5626 -7.8848 -7.6778 -7.3283 13.9036 2.7020
hfenergy: -1706.79176 hartree
pointgroup: C01 [X(C6H11N2O3P1S2)]
dipole: -0.8310296 -0.3042861 0.9108298 debye
dipolederiv: -0.8265155 -0.0325929 0.0266658 -0.059893 -0.2362259 0.0415105 0.188569 -0.0109016 -0.1599672 -0.6463066 -0.028472 0.2025238 -0.0827995 -0.362763 0.1144909 0.1747675 0.0426579 -0.5533296 2.1631117 -0.0101483 -0.2672387 0.0082033 1.2974253 -0.2933642 0.0654674 0.1012624 1.4664437 -0.7486034 0.0309211 -0.1222602 0.0380493 -0.6179975 -0.0152547 -0.1674446 -0.0218034 -0.0901443 -0.6305195 0.1521137 0.0730172 0.094025 -1.1483732 -0.0831412 0.0410385 -0.2430685 -0.5948565 -1.1379063 0.2256827 -0.2924484 0.2340473 -0.5747236 0.1840199 -0.4663479 0.2182491 -0.8138516 -0.1652685 -0.0620306 -0.0031915 0.1859876 -0.2742745 -0.0065829 0.1200417 -0.0481438 -0.1908629 -0.5373694 0.078315 0.0308764 -0.280366 -0.1354777 -0.0410959 -0.1424034 0.0280721 -0.1926529 0.1734596 -0.1040928 -0.0880917 -0.2468864 0.1122157 0.0358231 -0.265121 -0.0339763 0.1230622 0.6379616 -0.0271179 0.0304446 -0.0189842 0.3267841 0.0859442 0.1054167 0.0978299 0.020916 0.7709962 -0.0588748 0.1608112 0.1297352 0.4440919 -0.029974 0.1861102 -0.0013337 0.1215233 -0.2021194 0.0222519 -0.0659026 -0.1085105 0.0171472 -0.0236261 -0.0767351 0.0040877 0.0426686 0.1632293 -0.0932931 -0.0081182 -0.0704064 0.6360721 0.1438026 0.0372102 -0.1920586 0.1204178 0.6463563 -0.2220594 0.3435926 0.1108817 0.1714817 0.0837246 0.1288755 -0.0221268 0.3392771 0.0907359 0.0415097 -0.0269135 0.0495299 0.0816187 -0.068165 0.007207 -0.0283865 0.076757 -0.0092538 -0.0266855 0.0817211 0.0462817 0.0314612 0.0278872 0.1000305 0.0266298 0.04533 0.085588 0.0117701 -0.012896 0.0832559 -0.0338433 0.0153268 -0.0138289 -0.0018387 0.1326946 0.0497487 0.0164751 0.0059601 0.0005766 0.0905724 -0.0877391 -0.0528957 -0.0731073 -0.0255455 -0.0035883 -0.031386 0.0275287 -0.0586799 0.0799834 0.0815405 0.0700938 0.0766015 0.02495 0.0747784 -0.0225191 -0.0565653 -0.0253486 -0.0541395 -0.0818449 -0.066144 -0.082027 0.0019965 0.0488351 0.0785003 -0.0321557 0.0454823 0.026699 -0.0122225 -0.0528219 0.023842 0.0996194 0.0302483 -0.0415647 0.0832314 0.0210427 0.0512549 -0.0078053 0.0752138 0.1219163 -0.0102555 -0.0563415 0.0278312 0.0116435 -0.059872 0.1226446 -0.0145392 0.1371724 -0.0153415 -0.0240747 0.0234289 0.034965 -0.0595829 0.0276272 -0.0259377 0.0949965 -0.0808561 0.1068317 0.0370281 0.0053144 0.0405013 -0.0426518 -0.0629793 -0.0256962 -0.1437117 -0.0526154 -0.0738668 0.0028561 unknown
polarizability: 217.8190626|-6.8458955|128.2328757|-14.2929269|-1.3629197|125.4835849 unknown
InChI: InChI=1S/C4H5N2OS.C2H6O2PS/c1-3-5-6-4(2-8)7-3;1-3-5(6)4-2/h2H2,1H3;1-2H3
charge 0 multiplicity 1
25 atoms
S  0.321479 -1.756182 -1.061278
S  3.555354 -0.397524 -2.258933
P  2.385522 -0.86392 -0.628207
O  -2.89797 -0.72379 -0.039673
O  2.116674 0.39858 0.542435
O  2.928932 -2.062307 0.500934
N  -1.54595 1.045588 0.439902
N  -2.849794 1.552761 0.073428
C  -0.544849 -1.284011 0.591858
C  -1.611016 -0.283401 0.361372
C  -3.611399 0.49366 -0.199889
C  -5.035638 0.442698 -0.622296
C  1.832675 1.786097 0.086628
C  4.30748 -1.921387 1.036019
H  0.23122 -0.861492 1.248249
H  -0.935962 -2.223088 1.00814
H  -5.421856 1.469845 -0.70239
H  -5.141039 -0.05839 -1.600446
H  -5.647382 -0.114497 0.108984
H  2.20016 2.42887 0.901084
H  0.743475 1.908624 -0.035913
H  2.377547 2.00751 -0.849692
H  5.039594 -1.861547 0.210171
H  4.467889 -2.83794 1.622228
H  4.380253 -1.029556 1.682183
