program: Gaussian 09
title: 000210574
version: EM64L-G09RevD.01
frameworkgroup: C1[X(C14H20N2OS)]
method: RPBEPBE
basis: SDD
operation: Freq
keyword: #p
keyword: freq=noraman
keyword: PBEPBE/SDD
title: #p freq=noraman PBEPBE/SDD
converged: YES YES NO NO
title: Mulliken charges:
elementType: S O N N C C C C C C C C C C C C C C H H H H H H H H H H H H H H H H H H H H
charge: 0.357458 -0.263695 -0.106341 -0.418036 -0.341877 -0.403404 -0.322440 -0.321731 -0.263337 -0.677195 -0.672946 0.189145 0.329007 -0.350922 -0.354678 -0.254873 -0.223521 -0.218078 0.182163 0.201633 0.231826 0.208694 0.186683 0.204875 0.185487 0.204281 0.224368 0.225124 0.228925 0.207604 0.206904 0.229041 0.207794 0.207018 0.265324 0.245971 0.231817 0.231930
chargesum: 0.00000
title: Mulliken charges with hydrogens summed into heavy atoms:
elementType: S O N N C C C C C C C C C C C C C C
charge: 0.357458 -0.263695 -0.106341 -0.418036 0.041919 0.037116 0.069118 0.068037 0.186155 -0.033762 -0.029093 0.189145 0.329007 -0.350922 -0.089354 -0.008902 0.008297 0.013852
polarizability: 2.51087641e+02 -8.07335008e+00 1.94205302e+02 -1.28070488e+00 1.39948746e+01 1.19071179e+02
1716.lowfreq: -18.1321 -5.4641 -1.0771 -0.0011 0.0014 0.0019 7.9018 19.1470 35.1771
frequency: -7.8323 18.7906 35.1479 60.7025 63.6695 73.3740 92.5781 116.7233 141.9551 155.9475 164.8611 195.3866 206.9051 216.1851 274.7945 278.6629 282.2975 313.1582 339.9225 406.1995 417.0679 422.4872 457.1567 483.8696 487.3903 492.1293 560.7932 567.1913 635.3424 683.7468 697.5073 729.6746 738.6802 761.2646 770.8192 792.1696 796.3059 817.4000 853.2085 869.2065 918.7744 919.9352 956.6351 989.0560 992.0206 1014.7906 1032.1623 1044.1951 1073.1155 1074.3645 1079.1335 1084.1732 1086.9803 1110.5430 1129.3974 1136.6133 1164.7603 1174.2993 1203.1271 1218.0259 1260.4510 1261.2987 1269.8482 1280.3648 1289.3078 1298.4854 1332.7265 1359.2297 1365.5418 1376.8642 1386.4089 1387.2394 1388.7971 1396.3266 1406.8161 1453.7015 1457.4207 1459.7369 1462.2292 1468.5502 1470.9225 1476.9446 1478.5873 1485.4575 1488.6506 1490.1116 1576.8496 1601.2670 2839.2298 2845.5931 2859.3381 2983.0322 2983.3213 2990.9650 3008.5825 3024.6929 3029.9408 3033.8032 3046.6298 3073.9815 3076.0487 3081.8603 3091.5928 3092.3548 3135.1341 3148.2792 3160.6846 3172.8715
redmass: 4.0406 4.3494 4.1024 3.0076 2.3166 2.5692 1.7904 2.7762 2.5109 3.0844 4.4740 1.5617 5.6472 1.3617 3.0078 9.3737 1.9949 2.4169 4.1060 5.6409 3.2394 3.0915 2.8624 4.1893 4.7232 5.1114 7.5298 7.9770 5.1883 6.7207 8.5853 2.9926 2.6044 1.1283 1.5405 1.1475 1.1950 8.0224 1.2860 1.3446 5.4461 1.9525 1.3807 2.3812 1.3218 2.5238 5.4808 2.8810 1.8146 2.1924 2.5821 2.1540 2.5793 2.6366 1.7204 1.8642 1.4647 1.1042 2.2956 1.6808 1.1781 1.5020 1.1789 1.1350 1.2302 1.2799 2.2179 1.3279 1.3417 1.5002 2.1248 1.2441 1.2479 7.4838 2.5738 3.0267 3.3099 1.0692 1.0567 1.1043 1.0571 1.0782 1.0722 1.0730 1.0891 1.0740 7.0436 6.8537 1.0716 1.0722 1.0711 1.0358 1.0359 1.0573 1.0616 1.0843 1.0868 1.0876 1.1052 1.0988 1.0978 1.1047 1.1003 1.1002 1.0857 1.0897 1.0956 1.1004
irintensity: 0.4455 0.1738 0.6798 0.5431 0.7789 0.6287 0.2918 3.2051 0.3049 1.2733 2.4691 2.0826 0.5428 0.5513 1.4232 0.3360 1.5965 2.6019 0.8582 0.2847 6.9906 4.0192 12.8825 3.6820 10.1395 7.9686 3.9461 2.5630 11.8833 9.8589 13.0535 26.3034 8.4542 1.9628 62.3665 6.0125 5.7103 16.2251 0.9868 0.4401 63.0816 2.0296 1.4155 14.3407 0.0054 11.8022 18.1012 2.4150 10.7979 32.4418 44.8977 1.8151 4.7220 49.0751 10.8403 31.6729 13.6538 12.3551 27.3514 13.7344 1.4409 5.9167 7.4668 1.5301 14.1580 7.8269 332.5574 3.7628 16.3637 14.9219 3.8772 21.9194 18.2566 0.8519 55.2061 120.1263 11.6978 4.5491 4.5459 0.5181 1.8132 1.3449 10.0131 8.6914 12.5629 10.8766 6.9649 22.9929 43.3011 31.8131 240.3436 41.4510 22.0095 13.4598 14.7516 15.9172 23.8916 21.2278 3.3244 22.6253 93.1094 62.7840 39.4887 42.0220 1.5688 6.4936 14.9730 19.7904
temp: 298.150 k
press: 1.00000 atm
elementType: 16 8 7 7 6 6 6 6 6 6 6 6 6 6 6 6 6 6 1 1 1 1 1 1 1 1 1 1 1 1 1 1 1 1 1 1 1 1
symmnumber: 1
zpe: 825308.7 jmol-1
zpe.correction: 0.314343 hartree
zpe.thermalcorrener: 0.332605 hartree
zpe.thermalcorrenthalpy: 0.333549 hartree
zpe.thermalcorrgfe: 0.266067 hartree
zpe.sumelectzpe: -1126.868625 hartree
zpe.sumelectthermal: -1126.850363 hartree
zpe.sumelectthermalent: -1126.849419 hartree
zpe.sumelectthermalfe: -1126.916901 hartree
dipole: 0.5048 1.3621 -0.0811
dipole: 1.4549
quadrupole: -94.4085 -115.5143 -118.8209
quadrupole: -9.4640 -4.2830 -0.4320
quadrupole: 15.1728 -5.9331 -9.2397 -9.4640 -4.2830 -0.4320
hfenergy: -1127.1829682 hartree
pointgroup: C01 [X(C14H20N2O1S1)]
dipole: 0.17185 -0.5394457 -0.0842798 debye
polarizability: 251.7491997|4.7171404|184.4590548|2.9401006|28.066706|128.1558681 unknown
InChI: InChI=1S/C14H20N2OS/c1-3-16(4-2)10-7-11-17-14-12-8-5-6-9-13(12)18-15-14/h5-6,8-9H,3-4,7,10-11H2,1-2H3
charge 0 multiplicity 1
38 atoms
S  -3.529727 2.19924 1.102207
O  -0.456479 0.001438 0.033083
N  4.482327 -0.17666 0.063879
N  -1.757941 1.783133 0.914502
C  3.289378 0.649779 0.38401
C  1.965956 -0.068586 0.032918
C  4.74881 -1.210227 1.102549
C  5.683588 0.647734 -0.24396
C  0.755593 0.776136 0.428729
C  5.547272 -2.413528 0.565983
C  5.629527 1.287798 -1.644275
C  -1.67181 0.589168 0.313147
C  -2.897893 -0.111335 -0.058796
C  -4.04627 0.647054 0.30853
C  -3.045388 -1.365981 -0.698738
C  -5.349909 0.174642 0.047681
C  -4.34321 -1.843072 -0.96223
C  -5.484515 -1.077324 -0.591153
H  3.27933 0.95555 1.462719
H  3.347418 1.584994 -0.203403
H  1.947549 -0.272866 -1.052277
H  1.907677 -1.045394 0.548046
H  5.275222 -0.769355 1.988087
H  3.773547 -1.576728 1.472493
H  5.843682 1.441061 0.53086
H  6.566445 -0.015129 -0.197549
H  0.730544 1.7524 -0.092149
H  0.708334 0.967944 1.517706
H  5.009431 -2.87857 -0.278373
H  6.550989 -2.120229 0.208562
H  5.684988 -3.170685 1.360596
H  5.528032 0.503922 -2.414712
H  4.775023 1.980598 -1.750967
H  6.552664 1.864307 -1.841898
H  -2.154525 -1.938015 -0.976093
H  -6.234376 0.755064 0.328197
H  -4.479574 -2.810358 -1.456902
H  -6.487006 -1.464426 -0.804509
