program: Gaussian 09
title: 000210533
version: EM64L-G09RevD.01
frameworkgroup: C1[X(C13H17N3)]
method: RPBEPBE
basis: SDD
operation: Freq
keyword: #pfreq=noraman
keyword: PBEPBE/SDD
title: #p freq=noraman PBEPBE/SDD
converged: YES YES NO NO
title: Mulliken charges:
elementType: N N N C C C C C C C C C C C C C H H H H H H H H H H H H H H H H H
charge: -0.280046 -0.374011 -0.096017 0.002268 0.273695 0.126927 0.401208 -0.777820 -0.404766 -0.783003 -0.332876 -0.376083 -0.658305 -0.229988 -0.208227 -0.252678 0.257540 0.259534 0.218570 0.233690 0.233987 0.213761 0.239223 0.223235 0.243208 0.236348 0.281805 0.201699 0.233207 0.214536 0.223930 0.227085 0.228364
chargesum: 0.00000
title: Mulliken charges with hydrogens summed into heavy atoms:
elementType: N N N C C C C C C C C C C C C C
charge: -0.280046 -0.116471 -0.096017 0.002268 0.273695 0.126927 0.401208 -0.066025 0.042983 -0.077337 -0.096528 -0.094278 -0.008863 -0.006058 0.018857 -0.024315
polarizability: 2.56492764e+02 -7.94655270e+00 1.61149011e+02 6.19357447e+00 -1.26844734e+00 9.16957240e+01
1716.lowfreq: -6.7935 -0.0007 -0.0006 0.0002 5.3149 8.1515 29.6431 40.6208 46.4348
frequency: 28.5022 40.5389 46.3493 81.7152 114.0020 131.8831 157.4906 185.6247 201.6542 230.9497 243.4986 268.3557 290.5230 302.0512 320.6567 338.3578 370.4106 409.7196 459.2366 496.4409 521.6707 557.6033 608.8392 613.1089 628.2551 652.7519 693.3840 695.8675 712.6936 762.3821 787.9846 808.5570 838.0996 890.6530 909.4525 968.4516 973.0414 987.4699 989.7715 1013.1636 1015.6234 1033.4578 1037.0087 1041.5084 1044.0383 1075.4636 1095.2448 1115.4168 1151.8940 1170.8852 1185.6289 1217.5724 1276.2093 1285.6609 1321.3706 1345.4821 1363.4042 1380.6196 1385.1728 1394.6927 1405.8354 1427.2499 1444.1993 1449.0039 1459.5484 1466.2448 1469.2080 1471.4271 1474.6469 1482.8486 1485.5449 1498.6698 1507.9798 1579.9814 1596.9074 1612.9274 2967.0381 2972.3712 2972.9996 3004.0825 3045.7599 3050.1757 3054.0331 3072.0677 3074.8814 3086.2793 3099.5540 3127.9685 3138.5860 3159.8912 3182.5564 3186.6324 3492.2446
redmass: 2.8531 3.4359 3.8460 3.0986 3.3982 2.7892 1.2145 1.5833 1.1232 2.8700 1.7496 2.1004 3.3594 3.4497 3.4540 3.4220 3.3782 2.9149 2.8132 2.7320 2.1718 3.8495 5.0685 5.0087 6.0710 4.1280 4.3283 2.2291 2.7647 1.7260 4.3508 1.3473 1.2467 2.0471 1.4152 1.5247 1.7371 5.5553 1.3113 1.8612 3.8644 1.9317 1.5469 2.5967 1.4764 1.9589 1.9715 2.9012 2.2498 1.0521 1.1299 3.9439 3.3467 1.2061 1.3747 1.3157 4.4353 1.2200 7.5131 1.2746 1.2494 2.6237 1.6333 2.1368 1.0743 1.0682 1.1286 1.0676 1.1564 1.1022 1.2130 2.5792 3.6677 5.5124 6.4349 6.1719 1.0395 1.0355 1.0387 1.0623 1.0947 1.0958 1.1004 1.0989 1.0982 1.1022 1.0981 1.0851 1.0905 1.0967 1.0935 1.0961 1.0744
irintensity: 0.3930 1.5428 0.6204 1.6854 0.3915 1.6331 0.8024 3.2601 1.4326 1.1974 1.7033 1.4839 0.1879 3.7361 2.1312 10.0109 3.0619 0.8999 4.4836 42.8001 62.1269 2.2295 20.2976 11.6282 5.3259 7.6906 22.5748 35.8312 1.4048 63.7995 8.7552 12.9367 0.5925 4.0213 5.5225 0.6389 0.9605 1.9437 0.5405 0.8953 62.5442 0.6594 6.5727 10.7542 6.8133 9.3172 20.6140 31.7097 18.5569 0.1748 0.9191 59.3431 35.5777 1.2198 7.8019 30.6209 167.6559 21.3634 0.8372 22.7013 4.1915 8.2964 37.5515 9.6603 12.6994 4.6439 21.3818 14.1376 33.0669 4.7376 18.0477 147.4369 83.3817 39.3293 17.1823 96.8118 35.0428 31.8224 39.0206 62.2911 23.1513 20.3249 6.7447 63.7244 18.5551 64.2040 9.7859 1.1629 19.3148 38.0701 10.8340 1.8944 0.7412
temp: 298.150 k
press: 1.00000 atm
elementType: 7 7 7 6 6 6 6 6 6 6 6 6 6 6 6 6 1 1 1 1 1 1 1 1 1 1 1 1 1 1 1 1 1
symmnumber: 1
zpe: 722465.9 jmol-1
zpe.correction: 0.275173 hartree
zpe.thermalcorrener: 0.291127 hartree
zpe.thermalcorrenthalpy: 0.292071 hartree
zpe.thermalcorrgfe: 0.231118 hartree
zpe.sumelectzpe: -668.637334 hartree
zpe.sumelectthermal: -668.621380 hartree
zpe.sumelectthermalent: -668.620436 hartree
zpe.sumelectthermalfe: -668.681389 hartree
dipole: -1.3111 -2.7569 -0.2908
dipole: 3.0666
quadrupole: -81.9435 -88.5813 -100.4674
quadrupole: 1.1532 -1.0164 0.6241
quadrupole: 8.3872 1.7494 -10.1367 1.1532 -1.0164 0.6241
hfenergy: -668.9125069 hartree
pointgroup: C01 [X(C13H17N3)]
dipole: 0.5544168 1.0577362 -0.1716395 debye
polarizability: 254.7482983|-12.1823369|162.0324065|-13.3623686|0.0211326|92.5567948 unknown
InChI: InChI=1S/C13H17N3/c1-4-14-13-10(2)15-16(11(13)3)12-8-6-5-7-9-12/h5-9,14H,4H2,1-3H3
charge 0 multiplicity 1
33 atoms
N  -0.250307 -0.184034 -0.08695
N  3.222709 0.270451 -1.0515
N  0.233952 -1.473889 0.179072
C  1.943282 -0.113988 -0.57741
C  0.76926 0.66958 -0.544927
C  1.560934 -1.42776 -0.121922
C  -1.652186 0.045727 0.077367
C  0.586693 2.092425 -0.993569
C  4.404959 0.16791 -0.162434
C  2.412084 -2.657698 0.014184
C  -2.168882 1.332919 0.374789
C  -2.538284 -1.058621 -0.029867
C  4.393401 1.144385 1.039777
C  -3.561213 1.513806 0.528467
C  -3.923839 -0.866412 0.136478
C  -4.447619 0.420565 0.408156
H  3.217402 1.124036 -1.618387
H  -0.311373 2.221567 -1.623664
H  1.458298 2.405483 -1.595513
H  0.511012 2.804423 -0.148583
H  4.472539 -0.870266 0.207204
H  5.304498 0.340788 -0.78278
H  3.057206 -2.78311 -0.874791
H  3.072941 -2.613084 0.901559
H  1.768867 -3.547053 0.118585
H  -1.49853 2.183068 0.519463
H  -2.117964 -2.046803 -0.230437
H  4.39928 2.196952 0.6986
H  3.489372 0.987297 1.655457
H  5.280771 0.988698 1.682124
H  -3.948709 2.512353 0.760029
H  -4.598535 -1.725459 0.049749
H  -5.526119 0.56564 0.532173
