program: Gaussian 09
title: 000016718
version: EM64L-G09RevD.01
frameworkgroup: C1[X(C11H7NO)]
method: RPBEPBE
basis: SDD
operation: Freq
keyword: #p
keyword: freq=noraman
keyword: PBEPBE/SDD
title: #p freq=noraman PBEPBE/SDD
converged: NO YES NO NO
title: Mulliken charges:
elementType: O N C C C C C C C C C C C H H H H H H H
charge: -0.178835 0.071985 0.414056 0.386028 -0.575622 -0.385558 -0.407633 -0.406936 0.396360 -0.399923 -0.237780 -0.238296 -0.134971 0.257400 0.243684 0.240944 0.241597 0.250744 0.231378 0.231377
chargesum: 0.00000
title: Mulliken charges with hydrogens summed into heavy atoms:
elementType: O N C C C C C C C C C C C
charge: -0.178835 0.071985 0.414056 0.386028 -0.318222 -0.141874 -0.166689 -0.165339 0.396360 -0.149179 -0.006402 -0.006919 -0.134971
polarizability: 2.48418506e+02 -4.01841150e+00 1.21485381e+02 2.65688863e-02 9.93695385e-03 4.74074741e+01
1716.lowfreq: -44.6142 -5.8863 -0.0005 -0.0005 -0.0004 6.6756 15.5610 56.4191 148.9251
frequency: -44.5637 56.3749 148.9235 182.0787 276.9336 314.0954 346.3226 403.3918 441.8213 471.6062 478.3096 487.3590 515.7781 533.3633 607.8720 651.9538 653.3997 758.0775 760.6993 782.2484 828.1858 862.0473 873.3486 913.4553 938.2314 962.2218 977.9686 994.3263 1023.1045 1082.3454 1132.3393 1155.1910 1174.5729 1224.6877 1246.4451 1274.8051 1347.9028 1398.7352 1419.6700 1430.4859 1439.5245 1499.9891 1524.9812 1576.7970 1606.6979 1638.3825 2391.3636 3122.7336 3127.8364 3131.5138 3144.8511 3147.7945 3163.8186 3165.4687
redmass: 9.6115 7.5026 6.8431 3.6665 6.3532 5.1522 8.9448 3.1864 4.9992 7.0518 2.9135 11.7484 6.5404 3.5906 6.8434 6.8857 2.8008 4.8747 1.3085 2.5233 1.3526 5.5934 1.4986 1.7086 4.8726 1.3741 1.3923 1.3478 2.3042 2.5655 1.6964 1.2182 1.0771 2.0557 1.4640 1.7863 1.9322 4.2326 3.3966 2.6598 4.0243 3.9642 5.7696 7.2627 5.8502 6.8025 12.7390 1.0859 1.0893 1.0887 1.0949 1.0926 1.1001 1.0971
irintensity: 0.0411 0.0665 0.4399 1.3941 0.3122 0.7193 0.8764 0.0223 8.7510 1.4530 37.9824 12.4649 0.3479 0.0179 10.0023 3.3256 0.5497 0.4885 46.7601 0.3289 47.0859 17.3302 42.2059 20.9026 15.9340 6.4466 3.3546 0.0162 2.7297 46.9652 23.5337 3.1564 0.3807 21.1847 1.6767 6.3714 2.7148 9.1342 2.7829 11.1074 4.7995 15.4973 7.8874 2.6271 29.1720 29.3591 1790.1510 3.1414 0.3751 6.9342 23.4545 14.2149 38.2432 4.8502
temp: 298.150 k
press: 1.00000 atm
elementType: 8 7 6 6 6 6 6 6 6 6 6 6 6 1 1 1 1 1 1 1
symmnumber: 1
zpe: 387664.4 jmol-1
zpe.correction: 0.147654 hartree
zpe.thermalcorrener: 0.156787 hartree
zpe.thermalcorrenthalpy: 0.157731 hartree
zpe.thermalcorrgfe: 0.112724 hartree
zpe.sumelectzpe: -552.485553 hartree
zpe.sumelectthermal: -552.476419 hartree
zpe.sumelectthermalent: -552.475475 hartree
zpe.sumelectthermalfe: -552.520483 hartree
dipole: 3.7699 0.6458 0.0025
dipole: 3.8248
quadrupole: -86.1003 -63.4585 -78.5764
quadrupole: -3.3201 0.0090 0.0008
quadrupole: -10.0552 12.5866 -2.5313 -3.3201 0.0090 0.0008
hfenergy: -552.6332064 hartree
pointgroup: C01 [X(C11H7N1O1)]
dipole: -1.4748539 0.2923169 0.061542 debye
dipolederiv: -2.1858999 0.2751473 0.0736823 0.4271798 -0.3328088 -0.0161768 0.0834227 -0.0117333 -0.2781983 -2.4325339 0.2971196 0.0839068 0.538618 -0.3602158 -0.0282395 0.1032597 -0.0217937 -0.1923781 0.2126202 0.0382686 -0.0012813 0.0684372 -0.079384 -0.0121632 0.0007409 -0.0115918 0.0504951 -0.0047161 0.0502369 0.0051937 0.0286567 -0.1367575 -0.0145169 0.0035794 -0.0151054 0.0348597 -0.2938767 0.0178005 0.0040036 -0.1342072 0.0256744 0.0214266 -0.0073514 0.0176575 -0.1938038 0.0475031 -0.014407 -0.0062721 0.019307 0.1421229 0.022672 -0.0038078 0.0236332 -0.1475142 -0.1187759 -0.0393914 -0.004473 0.0098501 0.1105534 0.0223716 -0.0007759 0.0240524 -0.1716724 0.0172971 -0.0287313 -0.0070707 -0.1238586 0.1020096 0.024781 -0.0144646 0.0223212 -0.1662488 1.5065346 -0.2164278 -0.0552171 -0.3559933 0.2703523 0.0225273 -0.0671998 0.0186963 0.1117226 -0.2551301 0.0746477 0.0080653 0.1577837 0.0196409 0.0114975 0.0151758 0.0137066 -0.1777254 -0.0162978 0.090038 0.0036725 0.0976428 0.0961885 0.017348 0.004177 0.0174723 -0.1533393 0.0193471 -0.0969773 -0.0122209 -0.0846444 -0.0546431 0.0106787 -0.0114958 0.0109414 -0.160409 3.4352605 -0.4832957 -0.1225764 -0.7058607 0.4286636 0.0280378 -0.1378518 0.0217531 0.3209588 0.0618595 0.0184447 0.0043978 0.0751816 -0.0516739 -0.0197369 0.0091432 -0.0184618 0.1676346 0.0469007 0.0790455 0.0090733 0.0311918 -0.0786118 -0.0193796 0.0051889 -0.0206653 0.1526613 0.0628881 0.0839162 0.0091286 0.013811 -0.0831015 -0.0195352 0.0035248 -0.0215911 0.1559753 0.0608592 0.0121082 0.0034605 0.0884179 -0.0937871 -0.0222722 0.0094567 -0.0202942 0.1553881 -0.0024674 -0.0962776 -0.003135 -0.0796412 0.0172454 -0.0100389 -0.0016481 -0.0094891 0.168667 -0.0311044 -0.108674 -0.0036578 -0.1191723 -0.0210235 -0.0114107 -0.0044524 -0.0116436 0.1605991 -0.1302678 0.047409 0.0113198 0.0473003 0.0795559 -0.0078704 0.0113783 -0.0078645 0.1623277 unknown
polarizability: 248.4047303|0.8126919|120.8960152|-5.2500665|5.8307124|48.0106159 unknown
InChI: InChI=1S/C11H7NO/c13-8-12-11-6-5-9-3-1-2-4-10(9)7-11/h1-7H
charge 0 multiplicity 1
20 atoms
O  5.161395 -0.701239 -0.202048
N  2.792485 -0.171316 -0.096326
C  -0.916149 -0.569917 -0.027753
C  -1.326491 0.81599 0.092676
C  0.477646 -0.885895 -0.090001
C  -0.313881 1.83086 0.146748
C  -1.925251 -1.589499 -0.082651
C  -2.723771 1.127104 0.153352
C  1.44319 0.131212 -0.035036
C  1.038577 1.507159 0.085909
C  -3.279861 -1.255254 -0.021666
C  -3.683729 0.113491 0.097373
C  3.968607 -0.435015 -0.149642
H  0.79556 -1.930064 -0.182622
H  -0.618035 2.880062 0.238046
H  -1.616956 -2.637705 -0.174325
H  -3.030409 2.17594 0.244662
H  1.809592 2.282719 0.127352
H  -4.041759 -2.041194 -0.064547
H  -4.749759 0.360864 0.144397
