program: Gaussian 09
title: 000208227
version: EM64L-G09RevD.01
frameworkgroup: C1[X(C28H28N2O2)]
method: RPBEPBE
basis: SDD
operation: Freq
keyword: #p
keyword: freq=noraman
keyword: PBEPBE/SDD
title: #p freq=noraman PBEPBE/SDD
converged: YES YES NO NO
title: Mulliken charges:
elementType: O O N N C C C C C C C C C C C C C C C C C C C C C C C C C C C C H H H H H H H H H H H H H H H H H H H H H H H H H H H H
charge: -0.172262 -0.183021 -0.084686 -0.174924 -0.060835 -0.412385 -0.459490 -0.360173 -0.382497 -0.345835 -0.108889 -0.096748 0.423587 -0.409886 -0.387097 0.267522 0.272334 -0.392533 -0.401144 0.471394 -0.384385 -0.382927 -0.210473 -0.210887 -0.242058 -0.235541 -0.379036 -0.382401 -0.239830 -0.235128 -0.226951 -0.270502 0.230629 0.269230 0.223193 0.229339 0.190008 0.208665 0.187800 0.239253 0.205898 0.184133 0.213762 0.215374 0.203104 0.215699 0.276886 0.275692 0.279549 0.278772 0.241563 0.241413 0.226864 0.226317 0.232729 0.214889 0.229261 0.216747 0.217069 0.223848
chargesum: 0.00000
title: Mulliken charges with hydrogens summed into heavy atoms:
elementType: O O N N C C C C C C C C C C C C C C C C C C C C C C C C C C C C
charge: -0.172262 -0.183021 -0.084686 -0.174924 -0.060835 0.087474 -0.006958 0.038500 0.044556 0.044197 -0.108889 -0.096748 0.423587 0.019249 0.031706 0.267522 0.272334 -0.115646 -0.125452 0.471394 -0.104836 -0.104155 0.031090 0.030527 -0.015193 -0.009224 -0.146307 -0.167512 -0.010569 -0.018380 -0.009883 -0.046654
polarizability: 3.93515160e+02 -3.97240102e+01 2.79945151e+02 3.36847762e+01 1.29751939e+01 2.94946898e+02
1716.lowfreq: -11.8304 -7.4632 0.0005 0.0009 0.0010 2.3556 8.4676 10.9905 13.8977
frequency: 6.7237 8.7996 12.8278 19.5025 25.2087 35.8140 53.6012 64.7687 68.3062 105.0338 110.0801 141.6933 146.3878 154.0634 174.1775 203.0398 218.9827 226.6034 231.1178 239.6037 245.2484 267.7903 285.0339 295.4508 299.4820 305.2826 328.6804 383.2028 398.8565 403.3390 408.4007 424.3578 439.9236 448.0789 470.5233 495.1414 508.7675 515.2894 525.4568 528.5896 568.4184 590.4528 614.0462 614.8941 617.7283 660.1557 679.8076 683.4885 690.7189 704.9678 707.6640 719.0477 728.7845 755.9377 764.0858 769.4225 785.8477 802.8210 814.9606 842.2844 844.9548 861.2897 866.4668 872.8063 882.4287 910.7601 912.3765 933.0668 938.3184 955.5802 955.7633 969.4095 974.5877 977.5469 982.7114 985.6263 988.0712 989.6895 999.6061 1012.4863 1014.6507 1026.1673 1032.4599 1035.3364 1052.1379 1065.9693 1080.1995 1081.9772 1086.1219 1088.4885 1099.2298 1107.0567 1131.7783 1143.8181 1156.0836 1164.5522 1169.9484 1174.6835 1175.3406 1178.0852 1182.7471 1199.5005 1203.5609 1204.1507 1228.1696 1231.6638 1244.4650 1254.0464 1277.7090 1281.9692 1291.4041 1301.1515 1309.6775 1324.4045 1328.7282 1341.1435 1344.2795 1360.2691 1361.0898 1367.1147 1374.4477 1376.3858 1384.3078 1394.0025 1407.3340 1433.7220 1445.8850 1451.4585 1452.7419 1454.3373 1456.2876 1457.9314 1463.0009 1466.3399 1474.4234 1475.8441 1481.5073 1495.9003 1577.7448 1584.4896 1587.4906 1600.0035 1605.2871 1618.3079 1621.5668 1645.2827 2837.5498 2844.4746 2859.0124 2910.9649 2919.2613 2983.9865 3003.3380 3004.7059 3027.6811 3035.5956 3050.2921 3058.9665 3074.7177 3090.6708 3119.7193 3124.4801 3126.4221 3134.7445 3137.3469 3148.8306 3148.9644 3150.8989 3157.2360 3158.9487 3162.2073 3166.6778 3169.9894 3171.9526
redmass: 3.7519 5.3382 4.8860 3.9720 5.9384 5.1065 3.1601 4.9258 5.5926 4.2234 4.5170 6.3265 6.8216 3.9251 5.4058 3.3265 2.5232 3.1098 3.5704 2.1263 5.5448 4.1277 3.8279 3.2455 3.8701 2.6195 8.6102 2.0158 3.5470 2.8817 2.9149 3.7058 3.7876 4.4074 2.7983 3.8418 3.6518 3.1174 7.4544 5.4381 5.4057 4.4098 5.9596 6.3376 2.6927 4.2557 5.5982 4.2026 1.8037 2.8785 2.2242 3.4415 2.1782 1.8860 2.1177 1.9659 1.4510 3.3061 1.2956 2.6593 1.7177 1.2473 5.4849 1.5299 2.2053 1.6671 2.9089 2.1450 1.7727 1.4539 2.2423 3.1065 1.3245 5.1821 2.2884 1.6659 1.5632 3.8698 1.3253 1.3618 2.0455 2.4693 2.2343 2.1463 1.7871 2.2339 2.2236 2.3908 1.9250 1.6522 2.3861 2.1832 3.7906 2.9150 3.0828 2.4797 1.1010 1.1258 1.2939 1.8572 2.0094 1.1406 1.1152 1.1312 1.6010 1.5007 1.8299 2.3961 1.4014 1.5306 1.2325 1.2848 1.3575 1.3799 1.3781 1.3492 1.3865 1.7357 1.4652 1.5084 6.1191 1.5967 3.2751 1.4633 7.8669 2.2582 2.4017 2.4576 1.3161 1.6115 1.1152 1.1768 1.0924 1.1049 1.0934 1.1079 2.0689 2.4088 5.9232 7.7803 6.1316 7.6675 5.8257 6.0976 9.2129 12.1688 1.0708 1.0713 1.0693 1.0692 1.0709 1.0610 1.0843 1.0648 1.0895 1.0981 1.0894 1.0902 1.1019 1.0891 1.0843 1.0848 1.0886 1.0886 1.0864 1.0928 1.0922 1.0902 1.0953 1.0948 1.0956 1.1007 1.0981 1.1004
irintensity: 0.1372 0.0642 0.0295 0.1808 3.7981 0.1151 2.3080 0.5505 0.2875 1.0251 2.1596 3.6668 3.0038 1.7627 0.9062 2.1677 1.2074 2.9459 1.0653 2.0807 0.3526 1.6682 4.8897 5.3141 3.7724 2.6288 8.7625 3.0712 0.2299 0.0248 0.8636 0.7723 7.1037 0.1978 0.6890 0.6808 15.4917 11.2485 1.4246 5.4141 7.2766 43.9970 0.5561 0.0986 4.7051 0.2218 3.1627 0.0549 39.9381 32.9056 23.6375 3.7350 10.6932 73.4886 19.7808 37.8573 73.4336 0.9245 0.7190 6.5288 0.7931 0.1302 16.0739 2.9938 3.2104 2.4458 10.5560 18.5127 6.6104 2.5099 21.5689 30.4391 1.4278 12.8568 28.6358 3.5387 0.0975 0.1421 0.7168 0.0020 0.7571 37.3552 17.6890 5.1838 2.0268 3.7824 0.8345 0.3626 12.1592 3.0261 1.5308 5.6689 15.0364 54.2931 30.2818 4.7661 0.2240 5.4501 20.6425 3.1272 2.9565 1.1728 2.7617 8.0913 22.3963 82.7984 217.6903 155.1811 4.5209 14.8556 4.0761 36.7731 25.5774 3.5244 3.4849 6.4682 4.4115 15.8591 16.8274 2.3074 0.0203 48.8355 14.4366 1.8437 12.2460 14.1502 1.3285 0.8517 2.7169 2.7555 3.4312 28.0583 6.1355 36.0675 17.4425 12.6938 41.5569 149.5597 10.6127 146.9307 25.7199 1.7155 13.3217 203.1364 62.2813 90.2902 43.0423 46.8036 201.7744 57.7172 109.2095 20.0427 7.9207 26.7562 36.2523 43.7108 28.7886 23.1231 13.0229 25.2211 9.5674 0.0181 11.0485 13.2647 1.8149 13.0755 40.8193 4.4346 11.4695 43.5333 4.9430 27.1158 5.0409 26.8683
temp: 298.150 k
press: 1.00000 atm
elementType: 8 8 7 7 6 6 6 6 6 6 6 6 6 6 6 6 6 6 6 6 6 6 6 6 6 6 6 6 6 6 6 6 1 1 1 1 1 1 1 1 1 1 1 1 1 1 1 1 1 1 1 1 1 1 1 1 1 1 1 1
symmnumber: 1
zpe: 1288493.6 jmol-1
zpe.correction: 0.490761 hartree
zpe.thermalcorrener: 0.518593 hartree
zpe.thermalcorrenthalpy: 0.519537 hartree
zpe.thermalcorrgfe: 0.426552 hartree
zpe.sumelectzpe: -1341.434663 hartree
zpe.sumelectthermal: -1341.406832 hartree
zpe.sumelectthermalent: -1341.405887 hartree
zpe.sumelectthermalfe: -1341.498872 hartree
dipole: 4.0653 -1.8541 -0.4903
dipole: 4.4950
quadrupole: -180.6801 -177.5649 -181.2559
quadrupole: -14.2938 -15.3207 2.7440
quadrupole: -0.8465 2.2687 -1.4223 -14.2938 -15.3207 2.7440
hfenergy: -1341.9254242 hartree
pointgroup: C01 [X(C28H28N2O2)]
dipole: 1.5721252 -0.8075631 -0.0612618 debye
polarizability: 388.8672592|-39.3900896|286.2715394|41.280296|12.091132|293.2684108 unknown
InChI: InChI=1S/C28H28N2O2/c31-26-24-14-7-8-15-25(24)27(32)28(26,22-10-3-1-4-11-22)16-9-17-29-18-20-30(21-19-29)23-12-5-2-6-13-23/h1-8,10-15H,9,16-21H2
charge 0 multiplicity 1
60 atoms
O  3.970986 0.044473 2.334336
O  1.279016 -0.896639 -1.552667
N  -1.78729 -0.431883 1.694522
N  -4.36141 -0.245702 0.366003
C  2.390551 0.232817 0.395932
C  1.097475 0.289098 1.263764
C  0.658875 -1.067198 1.855294
C  -0.712084 -0.97421 2.562136
C  -2.110715 -1.297671 0.536434
C  -3.020905 -0.138319 2.460273
C  3.614841 -0.313907 1.180841
C  2.266122 -0.782116 -0.777691
C  2.684217 1.65682 -0.157797
C  -3.149935 -0.630884 -0.383915
C  -4.051553 0.566561 1.565267
C  4.27932 -1.360562 0.349659
C  3.493932 -1.629956 -0.799717
C  2.02069 2.112114 -1.327288
C  3.533731 2.55264 0.541224
C  -5.58348 -0.050303 -0.325314
C  5.482506 -2.054739 0.590936
C  3.889857 -2.601393 -1.742296
C  5.887907 -3.023883 -0.354847
C  5.100049 -3.294017 -1.509455
C  2.217158 3.42984 -1.795588
C  3.727477 3.870402 0.06886
C  -5.668389 -0.160833 -1.748062
C  -6.793537 0.224915 0.385898
C  3.07394 4.314908 -1.102292
C  -6.904032 -0.018995 -2.415127
C  -8.018058 0.374515 -0.29277
C  -8.092059 0.251556 -1.700923
H  1.274758 1.01524 2.079933
H  0.281464 0.694426 0.639679
H  0.617253 -1.836569 1.060129
H  1.399126 -1.420464 2.599602
H  -0.98036 -1.985951 2.964991
H  -0.621249 -0.294063 3.432025
H  -2.507359 -2.289967 0.874289
H  -1.197062 -1.474456 -0.057734
H  -2.764382 0.526018 3.30686
H  -3.47784 -1.072608 2.877985
H  -2.682189 0.25188 -0.878969
H  -3.423218 -1.359443 -1.166084
H  -4.967766 0.748289 2.147271
H  -3.638234 1.555425 1.260271
H  1.346866 1.438554 -1.866684
H  4.032835 2.229414 1.459897
H  6.075019 -1.841749 1.486231
H  3.271788 -2.804139 -2.622541
H  6.819139 -3.579924 -0.201048
H  5.439734 -4.052488 -2.223186
H  1.69714 3.764463 -2.70035
H  4.387034 4.549533 0.620991
H  -4.768943 -0.333636 -2.345573
H  -6.787699 0.293023 1.478326
H  3.226185 5.336994 -1.466764
H  -6.930442 -0.107576 -3.507849
H  -8.926185 0.577411 0.287398
H  -9.047321 0.366014 -2.223625
