program: Gaussian 09
title: 000208225
version: EM64L-G09RevD.01
frameworkgroup: C1[X(C8H13N4O3)]
method: RPBEPBE
basis: SDD
operation: Freq
keyword: #p
keyword: freq=noraman
keyword: PBEPBE/SDD
title: #p freq=noraman PBEPBE/SDD
converged: NO YES NO NO
title: Mulliken charges:
elementType: O O O N N N N C C C C C C C C H H H H H H H H H H H H H
charge: -0.219704 -0.166319 -0.205162 -0.053605 -0.026360 0.066023 -0.386084 -0.365336 -0.351848 -0.314767 -0.307123 -0.155732 0.349529 0.283394 -0.759594 0.280829 0.277399 0.243507 0.277532 0.223723 0.263362 0.262279 0.222076 0.358334 0.376333 0.265527 0.295826 0.265960
chargesum: 1.00000
title: Mulliken charges with hydrogens summed into heavy atoms:
elementType: O O O N N N N C C C C C C C C
charge: -0.219704 -0.166319 -0.205162 -0.053605 -0.026360 0.066023 -0.009751 0.192892 0.169191 0.172318 0.177232 0.202603 0.349529 0.283394 0.067719
polarizability: 2.11285576e+02 -3.45913121e-01 1.22841550e+02 -1.03561439e+00 -8.52782470e-01 7.10009844e+01
1716.lowfreq: -7.4074 -3.7985 -0.0008 -0.0003 -0.0001 5.5166 33.8088 40.0346 57.7768
frequency: 33.7655 40.0180 57.7706 83.6489 86.7216 110.7558 172.0817 189.7411 210.7244 254.9127 278.0295 329.1868 350.8474 361.0933 378.2723 463.1202 485.1285 514.8733 555.4710 570.9694 599.8268 629.1303 661.3959 672.5709 745.9710 759.2587 804.1083 828.7564 835.9898 880.8036 896.4563 923.1590 948.3673 957.1224 991.4175 995.4341 1029.5343 1040.4277 1055.1093 1073.2962 1099.4731 1116.2873 1160.5155 1171.7557 1189.0177 1206.8419 1245.9079 1262.5463 1285.3384 1295.3299 1337.7557 1346.0885 1363.5606 1381.0375 1392.3905 1407.1046 1436.5090 1449.7701 1453.0226 1459.5943 1459.6836 1462.7890 1471.4154 1622.8081 1680.6790 2977.9429 2980.0356 2987.1616 2989.6585 2996.3859 3076.1478 3079.5363 3080.9217 3109.3478 3113.7321 3145.9213 3298.1821 3511.8063
redmass: 3.5166 1.1291 3.7189 4.3278 3.8471 6.6807 3.4843 5.1427 1.8466 4.7860 4.0156 7.0709 7.4308 5.3789 2.1405 3.0000 5.2737 3.5932 3.9048 4.0166 4.2923 1.5218 2.1808 2.1973 1.7255 5.6786 5.0472 3.4457 1.8323 5.2669 4.0363 2.6328 3.3175 4.6904 2.0773 2.7002 2.6677 1.6830 1.8135 6.2323 2.2192 4.3470 2.9407 1.8864 2.2143 1.1858 1.5015 1.3880 1.1843 2.0150 1.5065 1.2291 1.5193 1.2516 1.2220 3.2286 1.2732 1.0747 1.0850 1.0467 1.1092 1.0951 1.6347 6.4294 9.0209 1.0692 1.0687 1.0619 1.0621 1.0395 1.0985 1.0977 1.1009 1.0975 1.0987 1.0984 1.1020 1.0784
irintensity: 0.5219 2.2746 0.2402 5.1309 2.6965 13.3322 10.9233 15.0412 1.4845 3.8554 12.9912 3.5676 3.6862 0.5755 5.0162 1.3633 20.0859 6.4361 0.6116 63.8183 10.0088 92.9724 12.0916 24.8217 52.1459 1.9990 3.7322 2.9231 3.8269 76.0722 19.4881 7.7746 25.5099 18.4354 11.3876 5.2839 29.1110 10.9661 14.9829 57.4242 12.5903 2.0113 55.2556 79.5219 188.5087 13.5362 66.6276 56.7963 4.3148 6.5537 35.3283 2.5867 6.4632 2.4654 94.6997 209.4952 112.6025 11.5032 0.2018 19.6357 43.6530 6.2916 232.9667 370.2342 316.9490 27.2217 21.5138 0.8248 42.9579 5.1879 1.8520 1.5616 12.4927 6.1571 5.4636 0.8885 29.2493 119.4802
temp: 298.150 k
press: 1.00000 atm
elementType: 8 8 8 7 7 7 7 6 6 6 6 6 6 6 6 1 1 1 1 1 1 1 1 1 1 1 1 1
symmnumber: 1
zpe: 579945.2 jmol-1
zpe.correction: 0.220889 hartree
zpe.thermalcorrener: 0.235329 hartree
zpe.thermalcorrenthalpy: 0.236273 hartree
zpe.thermalcorrgfe: 0.177985 hartree
zpe.sumelectzpe: -755.819757 hartree
zpe.sumelectthermal: -755.805318 hartree
zpe.sumelectthermalent: -755.804374 hartree
zpe.sumelectthermalfe: -755.862662 hartree
dipole: 3.6366 1.1029 0.4829
dipole: 3.8308
quadrupole: -29.1424 -80.7681 -84.7984
quadrupole: 4.9405 -4.6799 0.1084
quadrupole: 35.7606 -15.8651 -19.8955 4.9405 -4.6799 0.1084
hfenergy: -756.0406468 hartree
pointgroup: C01 [X(C8H13N4O3)]
dipole: 1.4443637 0.1677024 0.3964163 debye
polarizability: 210.8827602|4.4530066|93.3411748|-6.0172913|25.4831248|100.9041752 unknown
InChI: InChI=1S/C8H13N4O3/c1-7(13)9-8-6-12(10-15-8)11-2-4-14-5-3-11/h6,9H,2-5H2,1H3
charge 1 multiplicity 1
28 atoms
O  -4.435039 -0.354536 -0.501963
O  1.236014 1.364654 1.537642
O  3.046512 -1.108818 -1.289661
N  -1.732613 -0.084434 0.314712
N  -0.445248 0.325988 0.545858
N  -0.221273 1.274798 1.527752
N  3.114603 0.479995 0.409435
C  -2.790548 0.703684 1.019236
C  -2.03505 -0.658609 -1.033211
C  -4.138563 -0.033518 0.896057
C  -3.439385 -1.300725 -1.001403
C  0.712082 -0.142953 -0.083481
C  1.756917 0.518245 0.557585
C  3.756615 -0.379287 -0.562022
C  5.261649 -0.283175 -0.577746
H  -2.852429 1.715863 0.570223
H  -2.508456 0.809252 2.08092
H  -1.296096 -1.438542 -1.283065
H  -1.996756 0.146512 -1.794252
H  -4.131298 -0.957367 1.510177
H  -4.947301 0.627941 1.241504
H  -3.741146 -1.560186 -2.027634
H  -3.42754 -2.218737 -0.37798
H  0.760916 -0.877217 -0.876733
H  3.683627 1.083638 1.012888
H  5.59532 0.744684 -0.811479
H  5.656584 -0.964244 -1.344198
H  5.691202 -0.5650 0.401337
