program: Gaussian 09
title: 000208220
version: EM64L-G09RevD.01
frameworkgroup: C1[X(C18H17NO2)]
method: RPBEPBE
basis: SDD
operation: Freq
keyword: #p
keyword: freq=noraman
keyword: PBEPBE/SDD
title: #p freq=noraman PBEPBE/SDD
converged: YES YES NO NO
title: Mulliken charges:
elementType: O O N C C C C C C C C C C C C C C C C C C H H H H H H H H H H H H H H H H H
charge: -0.269663 -0.233301 -0.127200 -0.447316 -0.451447 -0.346914 -0.344803 0.085514 0.187164 0.167634 -0.370925 -0.384091 0.019817 -0.233694 -0.241925 0.311050 -0.348401 -0.370647 -0.236348 -0.231449 -0.229396 0.223136 0.238157 0.229941 0.216552 0.217150 0.263198 0.243023 0.242740 0.251589 0.265586 0.233369 0.234261 0.268742 0.270902 0.232581 0.232312 0.233099
chargesum: 0.00000
title: Mulliken charges with hydrogens summed into heavy atoms:
elementType: O O N C C C C C C C C C C C C C C C C C C
charge: -0.269663 -0.233301 -0.127200 0.013977 -0.004953 0.133434 0.140960 0.085514 0.187164 0.167634 -0.119336 -0.118504 0.019817 -0.000325 -0.007664 0.311050 -0.079659 -0.099745 -0.003767 0.000863 0.003703
polarizability: 2.61554373e+02 9.54506459e+00 2.16425869e+02 -4.77174179e+00 6.64160248e+00 1.41033167e+02
1716.lowfreq: -5.3909 -3.7512 -0.0009 -0.0007 0.0004 6.7203 27.6221 28.4353 45.8155
frequency: 27.4999 28.4282 45.8090 54.6811 67.9221 82.2385 90.6109 128.4841 135.9464 177.0900 209.8474 235.8442 244.4692 257.2502 287.5093 323.6039 350.3993 370.1408 403.9948 428.2663 446.5337 473.3196 563.7006 572.0932 590.3672 613.5827 631.3303 647.1621 682.9181 699.0411 708.2598 717.6805 741.4945 771.0687 776.3240 809.4243 844.2694 861.8462 867.4790 882.4155 898.0785 912.4767 918.3179 927.4813 949.2684 962.9819 978.7538 989.3036 990.7554 994.8341 1005.8270 1025.2410 1037.3563 1052.6778 1083.7027 1093.4974 1112.7283 1147.7943 1152.1606 1158.2678 1173.7221 1174.4852 1177.2591 1188.3277 1191.1029 1222.3697 1243.2582 1271.3879 1284.1492 1301.0799 1310.8879 1318.9550 1331.4222 1335.2782 1367.6985 1386.2958 1398.6557 1427.3758 1434.6148 1467.6409 1468.5020 1472.2417 1477.3653 1479.8089 1492.1299 1535.5093 1559.8068 1575.5826 1588.8201 1597.9973 1608.6972 2974.4930 2996.8468 3005.8028 3014.9856 3061.2854 3071.6995 3078.7197 3093.0664 3127.7490 3129.1180 3136.7873 3139.8523 3148.5760 3151.2626 3160.2338 3165.1653 3170.0312
redmass: 4.3253 5.6962 3.8657 3.5512 4.7672 3.2292 4.1265 7.0816 5.0254 4.6988 4.9063 2.9436 2.6999 2.8371 5.2130 5.8266 5.4496 5.6018 2.8508 4.6470 3.9421 5.0517 2.1407 4.0844 3.8302 6.4552 6.3145 6.0597 4.5948 2.4313 2.2715 6.5247 2.9675 1.5405 2.5731 2.8831 1.7441 1.2496 1.8961 2.0592 2.0682 2.3177 3.9212 1.6919 1.4757 1.4213 1.8397 4.6310 1.4762 1.3439 1.3345 2.2319 2.4647 1.9596 1.5934 2.3493 1.5782 1.8019 2.1076 2.2235 1.5109 1.2478 1.1118 1.1733 2.0148 1.2939 1.2751 1.4668 3.6207 1.3445 1.2381 1.3623 1.3914 1.5364 10.9097 9.0724 4.4693 2.3284 2.2835 1.1130 1.0891 2.4967 1.1079 2.5122 1.0975 8.7212 10.3168 6.8230 6.4181 6.1347 6.0648 1.0663 1.0632 1.0645 1.0620 1.0999 1.0969 1.1015 1.1060 1.0853 1.0852 1.0892 1.0883 1.0946 1.0926 1.0961 1.1008 1.1012
irintensity: 1.8216 3.6184 0.5805 1.0877 0.6143 1.9760 0.2389 1.5167 0.8721 0.5271 2.9888 6.1066 5.6274 1.3323 4.8333 12.0739 6.8627 7.0472 0.3456 2.9618 3.7572 6.1044 2.7918 0.0282 0.5516 0.1587 22.3289 27.2031 9.8505 31.1814 61.5860 7.6752 2.4225 42.2138 42.4782 14.3480 11.6765 2.7648 6.8180 5.5605 1.1880 10.8022 49.9211 9.6035 4.0506 0.9467 4.1581 2.6978 1.3370 0.4457 0.7998 3.4771 4.7446 4.7867 11.4507 3.7826 2.1038 3.4387 9.6006 4.1076 4.5936 1.4309 1.7118 15.2720 8.2084 13.2310 10.5979 2.5492 292.9149 3.6587 0.5824 17.1720 0.7194 6.3960 6.7272 5.0081 190.6288 26.6374 18.2241 8.5563 7.8354 6.3239 6.4856 7.9632 4.4577 151.2241 327.8382 8.7694 10.0154 10.9566 16.4587 46.9902 18.9796 37.5069 26.5562 25.6879 9.6822 29.9583 55.5407 0.9697 0.1426 3.6897 7.6212 29.9207 9.1528 17.1958 28.5490 22.3546
temp: 298.150 k
press: 1.00000 atm
elementType: 8 8 7 6 6 6 6 6 6 6 6 6 6 6 6 6 6 6 6 6 6 1 1 1 1 1 1 1 1 1 1 1 1 1 1 1 1 1
symmnumber: 1
zpe: 799882.7 jmol-1
zpe.correction: 0.304659 hartree
zpe.thermalcorrener: 0.322838 hartree
zpe.thermalcorrenthalpy: 0.323783 hartree
zpe.thermalcorrgfe: 0.256247 hartree
zpe.sumelectzpe: -899.839478 hartree
zpe.sumelectthermal: -899.821299 hartree
zpe.sumelectthermalent: -899.820354 hartree
zpe.sumelectthermalfe: -899.887891 hartree
dipole: -0.2170 1.6593 -2.8745
dipole: 3.3261
quadrupole: -92.4255 -109.3211 -131.3964
quadrupole: 0.2200 -3.4882 1.3836
quadrupole: 18.6222 1.7266 -20.3487 0.2200 -3.4882 1.3836
hfenergy: -900.1441371 hartree
pointgroup: C01 [X(C18H17N1O2)]
dipole: -0.039622 0.7918644 1.0410665 debye
polarizability: 263.1728105|-3.9157053|212.0164714|2.3747396|-16.1081092|143.8241281 unknown
InChI: InChI=1S/C18H17NO2/c20-17(14-8-2-1-3-9-14)15-10-4-5-11-16(15)18(21)19-12-6-7-13-19/h1-5,8-11H,6-7,12-13H2
charge 0 multiplicity 1
38 atoms
O  -1.202691 -0.711685 -2.27103
O  0.14738 -1.216004 0.927397
N  -2.725659 -0.882838 -0.523224
C  -3.793544 -1.95027 1.314843
C  -4.377152 -2.520961 -0.004537
C  -3.163021 -0.607637 0.873366
C  -3.312598 -2.141447 -1.060129
C  -1.674053 -0.280276 -1.165926
C  -1.120394 0.996157 -0.556647
C  0.162553 1.02359 0.065563
C  -1.814977 2.209762 -0.766061
C  0.722046 2.267253 0.458679
C  0.842057 -0.267198 0.439472
C  -1.256446 3.443286 -0.35992
C  0.016216 3.472806 0.253802
C  2.323819 -0.412811 0.271674
C  3.056017 0.367152 -0.663926
C  2.999642 -1.405894 1.03156
C  4.442652 0.160257 -0.828566
C  4.385409 -1.601313 0.875558
C  5.111106 -0.817247 -0.055294
H  -4.553505 -1.816935 2.103345
H  -3.003316 -2.619658 1.700066
H  -4.548014 -3.609812 0.035994
H  -5.340653 -2.030861 -0.238502
H  -3.9092 0.211468 0.896428
H  -2.295987 -0.322472 1.491517
H  -2.518282 -2.907221 -1.14875
H  -3.726076 -1.975336 -2.069738
H  -2.789661 2.188611 -1.266315
H  1.699418 2.284316 0.952934
H  -1.808851 4.37438 -0.527842
H  0.453723 4.424613 0.573592
H  2.5355 1.106229 -1.281498
H  2.414303 -2.013376 1.729883
H  4.999193 0.753083 -1.562534
H  4.90205 -2.362565 1.470204
H  6.188398 -0.973545 -0.181637
