program: Gaussian 09
title: 000208218
version: EM64L-G09RevD.01
frameworkgroup: C1[X(C19H20N2O2)]
method: RPBEPBE
basis: SDD
operation: Freq
keyword: #p
keyword: freq=noraman
keyword: PBEPBE/SDD
title: #p freq=noraman PBEPBE/SDD
converged: YES YES NO NO
title: Mulliken charges:
elementType: O O N N C C C C C C C C C C C C C C C C C C C H H H H H H H H H H H H H H H H H H H H
charge: -0.269806 -0.232218 -0.116216 -0.065694 -0.361909 -0.383638 -0.383582 -0.371433 0.110520 -0.612977 0.146029 0.169795 -0.347905 -0.384592 0.023902 -0.236465 -0.240692 0.309417 -0.342569 -0.369722 -0.235895 -0.230834 -0.229076 0.216064 0.233065 0.252922 0.221950 0.238255 0.208118 0.211802 0.215685 0.193802 0.221541 0.221009 0.250640 0.265163 0.234539 0.234869 0.267673 0.270293 0.232622 0.232398 0.233150
chargesum: 0.00000
title: Mulliken charges with hydrogens summed into heavy atoms:
elementType: O O N N C C C C C C C C C C C C C C C C C C C
charge: -0.269806 -0.232218 -0.116216 -0.065694 0.087220 0.091235 0.062791 0.056053 0.110520 0.023375 0.146029 0.169795 -0.097265 -0.119429 0.023902 -0.001927 -0.005823 0.309417 -0.074896 -0.099429 -0.003273 0.001564 0.004074
polarizability: 2.75681960e+02 8.40363670e+00 2.45491538e+02 -4.89028899e+00 1.08901683e+00 1.57091132e+02
1716.lowfreq: -9.0019 -0.0007 0.0003 0.0006 2.4136 10.6200 23.9522 30.0745 39.9577
frequency: 23.7783 30.0646 39.8672 49.4790 60.9076 71.2098 92.2730 127.0517 134.8163 170.3299 171.3272 198.7389 212.4919 227.6805 261.2052 299.4762 318.1242 327.8622 348.6941 358.3101 363.1383 400.5264 404.4504 424.0023 436.2486 448.3648 474.9908 546.8833 572.9141 600.9520 613.0346 624.7602 631.8744 676.4659 687.0324 702.7873 710.1001 726.2328 746.0966 772.3049 779.6843 809.2020 838.0605 861.9105 870.6082 895.8280 918.5113 931.8456 949.3426 963.5332 989.3677 991.3066 995.6224 997.9827 1006.3359 1015.5554 1025.0691 1039.2511 1049.9551 1063.0970 1071.1105 1083.6597 1095.1865 1120.9627 1142.2890 1154.4889 1159.0160 1164.9673 1174.2040 1177.3740 1188.6502 1197.3088 1232.2533 1258.7288 1273.5541 1283.4104 1288.1269 1291.4916 1319.9485 1333.0252 1349.2880 1357.5667 1368.1693 1370.3930 1386.3786 1417.1923 1428.7422 1430.3089 1434.5084 1447.3410 1455.3908 1459.6155 1461.1807 1473.3639 1477.5095 1480.2397 1482.1697 1537.7373 1560.3375 1576.9427 1589.1798 1597.1067 1608.3978 2863.3899 2876.3610 2904.9694 2989.0515 2996.3449 3017.9088 3028.9178 3033.7678 3075.0943 3094.9471 3095.9199 3128.0307 3128.9644 3136.4931 3139.8125 3148.4877 3151.3158 3160.2906 3165.5923 3169.9876
redmass: 5.1721 5.1980 3.9231 3.9940 4.9495 4.4209 4.3648 8.4291 5.1530 2.9497 3.6601 2.7241 5.1853 1.2724 4.4710 4.0011 2.2163 3.1001 2.8992 3.9176 7.0409 2.9436 2.8574 2.9213 4.3609 3.9441 2.8555 3.8655 5.0693 2.8972 6.4457 4.0135 6.1227 4.7916 4.1751 1.7756 4.6876 5.1393 3.3379 1.5656 2.5073 2.8952 1.5837 1.2550 2.9864 1.5750 5.0254 2.2004 1.4709 1.4133 4.5568 1.4913 1.3400 2.4883 1.3346 2.9202 2.2365 2.3094 1.6746 1.7357 2.0617 1.5806 1.9626 1.5974 2.5341 2.2842 2.7126 2.2819 1.0654 1.0653 1.1414 1.1065 3.0948 1.9404 1.4909 3.1957 1.5475 1.4945 1.3551 1.2528 1.3372 1.3482 5.5608 1.6207 9.1358 2.2350 1.4066 1.7297 2.2740 1.0910 1.1970 1.0810 1.0536 2.4550 1.1105 2.5859 1.0540 9.6349 8.3027 6.8419 6.4641 6.0999 6.0542 1.0578 1.0676 1.0677 1.0662 1.0651 1.0741 1.0907 1.0917 1.1010 1.0979 1.0968 1.0855 1.0852 1.0893 1.0883 1.0945 1.0926 1.0961 1.1008 1.1012
irintensity: 2.6021 0.9316 1.0424 1.3897 2.7014 0.8679 0.3172 1.5316 0.5038 0.6959 0.6517 2.9368 0.9079 1.4119 3.4926 1.8068 1.0669 26.6996 3.2199 2.1931 9.0749 4.0192 1.1573 0.8720 4.0420 1.6982 0.5020 11.9133 0.1925 0.2146 0.1116 9.6783 34.7665 1.8230 4.3156 69.0684 29.9711 6.6667 5.5635 43.3903 41.8065 12.9528 0.0874 2.7840 6.7839 1.7588 50.4001 2.3887 3.9890 1.8586 3.5326 1.3816 0.2254 79.0887 0.8590 37.1385 3.7098 2.4829 9.5842 8.9856 1.0357 12.2068 6.9641 9.0140 35.0568 7.4809 8.1508 2.2118 0.4378 1.3290 16.7430 4.7211 3.7480 98.8611 5.3735 269.2164 36.9845 67.5314 15.0133 0.9218 6.0836 4.5726 6.8774 2.1347 4.4489 52.1209 11.1621 54.1469 18.4891 21.0585 17.0204 1.7227 31.9433 5.3095 12.6288 6.5595 8.1309 169.9195 307.7247 6.5680 10.3047 9.0852 16.3386 75.2180 91.3420 46.6721 24.8443 49.3339 54.1115 56.2594 71.6614 34.5587 6.3086 18.5734 1.2476 0.1106 3.3246 7.4661 26.9093 10.6831 18.0379 28.1265 21.8272
temp: 298.150 k
press: 1.00000 atm
elementType: 8 8 7 7 6 6 6 6 6 6 6 6 6 6 6 6 6 6 6 6 6 6 6 1 1 1 1 1 1 1 1 1 1 1 1 1 1 1 1 1 1 1 1
symmnumber: 1
zpe: 916000.8 jmol-1
zpe.correction: 0.348886 hartree
zpe.thermalcorrener: 0.369287 hartree
zpe.thermalcorrenthalpy: 0.370231 hartree
zpe.thermalcorrgfe: 0.298171 hartree
zpe.sumelectzpe: -994.311844 hartree
zpe.sumelectthermal: -994.291443 hartree
zpe.sumelectthermalent: -994.290499 hartree
zpe.sumelectthermalfe: -994.362558 hartree
dipole: -1.3246 1.1761 -2.6359
dipole: 3.1759
quadrupole: -113.4728 -117.8209 -141.2151
quadrupole: 1.0719 0.3003 -1.4131
quadrupole: 10.6968 6.3487 -17.0455 1.0719 0.3003 -1.4131
hfenergy: -994.6607299 hartree
pointgroup: C01 [X(C19H20N2O2)]
dipole: 0.4914504 0.5847632 0.9887969 debye
polarizability: 275.3103045|-9.2185625|244.0791098|1.352555|-13.2358141|158.8752151 unknown
InChI: InChI=1S/C19H20N2O2/c1-20-11-13-21(14-12-20)19(23)17-10-6-5-9-16(17)18(22)15-7-3-2-4-8-15/h2-10H,11-14H2,1H3
charge 0 multiplicity 1
43 atoms
O  -0.61324 0.023493 -2.339469
O  0.02258 -1.067684 0.836975
N  -2.448643 0.465511 -0.961399
N  -4.373615 -1.211757 0.359081
C  -3.01653 0.870655 0.342401
C  -3.332291 -0.420881 -1.750442
C  -3.43352 -0.377058 1.151063
C  -3.741089 -1.64792 -0.912196
C  -1.120132 0.600628 -1.321643
C  -4.895869 -2.350944 1.139756
C  -0.258328 1.558418 -0.518678
C  0.877316 1.085878 0.201655
C  -0.463435 2.951315 -0.655237
C  1.780077 2.019495 0.772031
C  1.035991 -0.387217 0.479102
C  0.43542 3.875153 -0.07491
C  1.560022 3.40847 0.641921
C  2.387426 -1.024158 0.368534
C  3.41253 -0.472494 -0.446513
C  2.622128 -2.248219 1.052079
C  4.654288 -1.132522 -0.567674
C  3.866388 -2.897918 0.940569
C  4.886485 -2.340616 0.130172
H  -3.907821 1.50392 0.16415
H  -2.270127 1.451442 0.906254
H  -2.78198 -0.72827 -2.654337
H  -4.238524 0.146278 -2.037607
H  -2.511601 -0.939197 1.435429
H  -3.945416 -0.051602 2.076319
H  -4.472782 -2.250386 -1.482346
H  -2.836285 -2.280458 -0.730619
H  -4.099286 -3.066144 1.465694
H  -5.631046 -2.910227 0.533344
H  -5.410863 -1.97727 2.043174
H  -1.322455 3.310767 -1.233031
H  2.641656 1.654123 1.341195
H  0.261691 4.950728 -0.189065
H  2.259003 4.118304 1.097035
H  3.224337 0.448478 -1.007589
H  1.812064 -2.669787 1.656535
H  5.435473 -0.711924 -1.210089
H  4.044941 -3.836464 1.476516
H  5.85266 -2.849537 0.038161
