program: Gaussian 09
title: 000210506
version: EM64L-G09RevD.01
frameworkgroup: C1[X(C14H21NO3)]
method: RPBEPBE
basis: SDD
operation: Freq
keyword: #p
keyword: freq=noraman
keyword: PBEPBE/SDD
title: #p freq=noraman PBEPBE/SDD
converged: YES YES NO NO
title: Mulliken charges:
elementType: O O O N C C C C C C C C C C C C C C H H H H H H H H H H H H H H H H H H H H H
charge: -0.268791 -0.451845 -0.250860 -0.050933 -0.051045 -0.506097 -0.472164 -0.434879 -0.329052 -0.374533 -0.331519 0.268207 0.168259 -0.322896 -0.334619 -0.259224 -0.253583 -0.538713 0.225180 0.217633 0.251151 0.220142 0.254895 0.213414 0.224150 0.222808 0.191519 0.226125 0.217934 0.180369 0.193216 0.248154 0.337827 0.240713 0.223325 0.223441 0.218268 0.221576 0.242448
chargesum: 0.00000
title: Mulliken charges with hydrogens summed into heavy atoms:
elementType: O O O N C C C C C C C C C C C C C C
charge: -0.268791 -0.114019 -0.250860 -0.050933 0.174134 -0.037312 0.002873 0.002686 0.085275 0.069526 0.042066 0.268207 0.168259 -0.074741 -0.093906 -0.035899 -0.030143 0.143578
polarizability: 2.02833502e+02 -4.86504928e+00 1.90082199e+02 -8.15078283e+00 -4.30895546e+00 1.11858692e+02
1716.lowfreq: -9.2112 -0.0006 -0.0003 0.0004 1.2528 10.2517 17.3772 23.7175 41.8188
frequency: 17.1396 23.6119 41.8138 53.5008 72.6385 88.8949 105.5132 112.1632 146.5908 156.5360 177.5826 211.6525 243.2503 268.1520 278.3502 295.8704 309.4635 323.4254 328.7708 408.7179 422.0758 462.4284 475.3709 484.4889 556.1407 559.4672 582.9795 648.3501 703.9427 724.8172 739.9413 743.8279 767.4215 789.1449 813.9609 826.8513 834.6019 856.8928 882.5619 898.6316 907.3134 937.9124 951.0040 954.7645 971.1534 985.3944 1014.6915 1025.0844 1044.3384 1048.5253 1060.0772 1085.7427 1100.3759 1112.2868 1112.3518 1144.8560 1150.3431 1171.6652 1183.4484 1188.8670 1194.9704 1207.0182 1217.5414 1225.6132 1243.3510 1275.1352 1277.1789 1281.2945 1295.2109 1296.8967 1303.1885 1315.5383 1328.7750 1331.1639 1386.5526 1394.5792 1414.2082 1426.5097 1441.6135 1447.3373 1455.8854 1466.0416 1470.9841 1471.7134 1473.4393 1480.2025 1490.6971 1493.7459 1592.8495 1599.0270 2919.3644 2926.3967 2954.9528 2971.7768 2981.1988 2983.5023 2999.4022 3006.5230 3013.6769 3018.6029 3041.3363 3067.5235 3076.3592 3086.6722 3107.6079 3121.9660 3132.8168 3147.7693 3161.0899 3172.4051 3562.9096
redmass: 4.5564 4.4235 3.9001 2.0438 4.4406 2.9120 3.2019 3.4615 3.0456 3.1800 2.7476 3.3950 1.4416 1.1722 2.8687 3.1151 3.3187 3.4746 2.8799 2.2199 3.5395 3.3219 3.1266 4.8359 4.1312 4.0112 6.6544 3.1500 3.7921 3.6612 1.4340 2.8085 5.1223 1.1000 2.6609 1.5427 2.3069 3.9118 1.2497 1.4066 2.7668 2.6133 2.1335 1.4826 5.8430 8.5831 2.5109 2.6644 2.2408 2.1430 2.7267 2.4213 1.9221 2.0712 1.2654 1.6677 1.4594 1.0838 1.1900 1.2736 2.4966 1.3061 1.3910 1.3955 2.8993 1.4222 1.1605 1.3813 1.2560 1.3333 1.2023 1.3222 1.2322 1.4810 1.3434 8.6641 1.4421 1.6723 1.4342 1.0853 1.0894 1.0503 1.0816 1.1042 1.0900 1.0857 1.2835 1.7761 6.0897 7.4580 1.0612 1.0591 1.0331 1.1065 1.0672 1.0726 1.0777 1.0657 1.0872 1.0667 1.1037 1.0990 1.1041 1.1030 1.0953 1.0991 1.0848 1.0897 1.0932 1.0997 1.0664
irintensity: 0.3189 0.1996 1.4382 11.4746 1.2548 6.4836 2.2834 2.9470 2.5689 0.7653 1.3836 0.4412 0.3280 137.4613 17.6192 1.1493 1.1606 2.2483 5.8661 12.5104 8.3148 1.7073 21.4067 2.8502 3.2905 0.3141 2.2524 9.6564 3.6423 2.0845 91.1432 50.6114 2.7037 4.4347 1.4851 0.3525 4.9704 27.2925 0.1270 5.3497 5.7409 30.6157 22.5611 8.4264 79.6897 41.5295 25.7878 4.8817 27.8807 21.5807 0.6137 16.1599 17.0850 106.8492 1.0304 4.4146 14.4810 3.9554 18.2554 9.9858 113.1096 9.3753 23.2259 22.4700 201.2988 6.0075 2.7433 7.9786 6.7898 5.5195 3.0189 3.3427 11.5395 21.9349 6.4153 1.1847 5.7367 12.2509 23.0423 15.1716 3.1004 12.5318 9.3558 64.2766 5.4314 5.5195 46.2544 93.1478 53.5066 9.1194 8.6876 102.4568 72.7264 59.5922 44.9582 26.7485 67.8247 24.0464 27.0421 45.8868 49.1606 10.7934 63.1050 40.5217 12.1746 23.0062 0.3445 18.6051 29.0441 12.2997 2.0627
temp: 298.150 k
press: 1.00000 atm
elementType: 8 8 8 7 6 6 6 6 6 6 6 6 6 6 6 6 6 6 1 1 1 1 1 1 1 1 1 1 1 1 1 1 1 1 1 1 1 1 1
symmnumber: 1
zpe: 863344.0 jmol-1
zpe.correction: 0.328830 hartree
zpe.thermalcorrener: 0.347413 hartree
zpe.thermalcorrenthalpy: 0.348357 hartree
zpe.thermalcorrgfe: 0.279733 hartree
zpe.sumelectzpe: -825.049937 hartree
zpe.sumelectthermal: -825.031354 hartree
zpe.sumelectthermalent: -825.030410 hartree
zpe.sumelectthermalfe: -825.099034 hartree
dipole: 2.5080 0.9839 -2.0789
dipole: 3.4030
quadrupole: -116.9818 -85.3818 -109.7182
quadrupole: -1.5487 7.0589 -5.7380
quadrupole: -12.9545 18.6455 -5.6909 -1.5487 7.0589 -5.7380
hfenergy: -825.378767 hartree
pointgroup: C01 [X(C14H21N1O3)]
dipole: 0.9835385 -0.1743304 0.8914724 debye
polarizability: 202.0093057|7.3747724|185.9704888|9.0152383|-18.6721303|116.794598 unknown
InChI: InChI=1S/C14H21NO3/c1-17-13-5-2-3-6-14(13)18-12-7-9-15(11-12)8-4-10-16/h2-3,5-6,12,16H,4,7-11H2,1H3
charge 0 multiplicity 1
39 atoms
O  0.209117 0.294252 -0.665153
O  -4.876746 -2.787858 0.018136
O  0.934782 -2.069149 0.257739
N  -2.629258 1.574696 -0.424179
C  -0.293089 1.612764 -1.133266
C  -1.750905 1.358739 -1.605247
C  -0.442345 2.627468 0.039956
C  -1.997323 2.743508 0.254645
C  -2.799415 0.37268 0.450559
C  -3.762183 -0.652951 -0.180109
C  -3.94281 -1.882501 0.713699
C  1.560276 0.173119 -0.322254
C  1.959541 -1.115244 0.161882
C  2.523717 1.200281 -0.433092
C  3.30955 -1.345884 0.505259
C  3.875775 0.958757 -0.085554
C  4.2686 -0.310116 0.379568
C  1.310313 -3.402597 0.729683
H  0.362648 1.97108 -1.951004
H  -2.005694 2.105279 -2.383495
H  -1.868966 0.35238 -2.034638
H  0.006624 3.606473 -0.206542
H  0.070268 2.238345 0.936354
H  -2.281526 2.774065 1.319857
H  -2.366372 3.672107 -0.223239
H  -1.828533 -0.120829 0.685681
H  -3.235944 0.73123 1.403159
H  -4.742932 -0.176409 -0.35877
H  -3.379085 -0.994269 -1.160069
H  -4.353862 -1.580727 1.703017
H  -2.960842 -2.378583 0.878797
H  2.227454 2.193167 -0.78365
H  -5.013353 -3.601013 0.566859
H  3.624023 -2.32755 0.87223
H  4.60906 1.766559 -0.179972
H  5.311857 -0.503827 0.650123
H  1.716097 -3.368592 1.760296
H  2.05187 -3.876118 0.05662
H  0.375809 -3.982733 0.717114
