program: Gaussian 09
title: 000210559
version: EM64L-G09RevD.01
frameworkgroup: C1[X(C20H23Cl3O2)]
method: RPBEPBE
basis: SDD
operation: Freq
keyword: #p
keyword: freq=noraman
keyword: PBEPBE/SDD
title: #p freq=noraman PBEPBE/SDD
converged: YES YES NO NO
title: Mulliken charges:
elementType: Cl Cl Cl O O C C C C C C C C C C C C C C C C C C C C H H H H H H H H H H H H H H H H H H H H H H H
charge: 0.085177 0.088789 0.105810 -0.435658 -0.436438 -0.397713 0.574482 0.566946 0.426340 0.416420 -0.240443 -0.248241 -0.519473 -0.539090 -0.650521 -0.450284 -0.450120 0.077229 0.068260 -0.397506 -0.395054 -0.691720 -0.703609 -0.699539 -0.693436 0.277435 0.255723 0.258957 0.258197 0.258985 0.241462 0.230122 0.217476 0.216769 0.229529 0.211365 0.212029 0.226477 0.213482 0.214483 0.205600 0.215678 0.225929 0.215245 0.211518 0.228321 0.357457 0.357157
chargesum: 0.00000
title: Mulliken charges with hydrogens summed into heavy atoms:
elementType: Cl Cl Cl O O C C C C C C C C C C C C C C C C C C C C
charge: 0.085177 0.088789 0.105810 -0.078201 -0.079282 -0.120278 0.574482 0.566946 0.426340 0.416420 0.015280 0.010716 -0.261276 -0.280105 -0.650521 -0.208822 -0.219998 0.077229 0.068260 -0.180030 -0.178285 -0.038798 -0.049167 -0.052332 -0.038353
polarizability: 3.01088219e+02 1.04288309e+01 2.45155760e+02 7.74528108e+00 2.37956775e+01 2.23723553e+02
1716.lowfreq: -35.3108 -5.3644 -4.8448 -0.0016 -0.0009 0.0015 4.2636 6.9252 17.4572
frequency: -34.9031 -3.4500 17.0261 26.4415 32.8676 47.0065 58.7060 75.1743 112.1963 115.3749 118.3979 144.7239 152.8013 166.4114 192.2435 199.7458 211.0087 218.0227 222.3098 239.1483 246.7602 249.0091 262.5163 276.1901 280.1906 295.6059 303.0812 320.3823 345.9089 352.9773 361.0463 367.3455 382.0382 397.4582 401.7390 475.6854 477.7304 502.9138 505.0977 508.8220 520.5743 553.7862 566.1599 594.4691 614.6345 636.4711 689.8775 691.4078 731.8600 732.9423 748.1548 755.7213 789.1398 798.3755 803.8845 811.2293 866.5835 876.6305 907.0625 916.8253 920.1568 921.5875 926.3902 928.9095 937.3444 949.3496 954.6608 956.1807 1008.4839 1066.2037 1068.1043 1086.7469 1090.1501 1111.6580 1116.2211 1139.0624 1142.1887 1157.7038 1166.8381 1176.6911 1182.1276 1214.2816 1219.1718 1244.8106 1248.8395 1252.9919 1286.3316 1301.0144 1320.3682 1321.6565 1324.1516 1350.7170 1352.9197 1375.2860 1377.0716 1392.4674 1393.8314 1399.2636 1402.4972 1428.7848 1431.4155 1465.2824 1466.2016 1467.0916 1468.6737 1479.2989 1480.7643 1483.3265 1484.0367 1493.7653 1495.8172 1602.4247 1603.6449 1613.5117 1616.0856 2971.2991 2971.3661 2974.2446 2975.8629 2997.9932 3027.8780 3030.9047 3063.1777 3063.4725 3073.8831 3074.0407 3075.0667 3076.8741 3081.1046 3081.7603 3108.8870 3110.1265 3137.2545 3144.8107 3152.0600 3153.5229 3582.4381 3583.8448
redmass: 2.5483 2.6768 4.2403 4.5541 5.9059 12.2104 9.8734 5.9042 3.6483 3.7901 3.3217 6.7048 6.1676 7.3630 10.7028 1.2029 3.4287 3.2660 1.1811 1.2716 1.3394 2.3035 5.0823 12.5750 4.7228 3.3635 4.2961 4.3061 5.1193 1.2273 1.4171 2.2165 6.0636 2.9217 2.8504 3.1577 3.1695 4.7547 4.1424 4.3120 3.8721 3.8080 3.8348 5.3164 5.3352 5.0731 8.4715 5.0623 4.4160 4.1319 3.6398 3.7642 2.1731 4.1926 1.7661 2.6707 3.0412 2.7538 1.6444 1.3380 1.3659 1.2061 1.6876 1.9363 1.4910 2.4978 1.4127 1.4279 5.7039 2.4288 2.3546 1.5912 1.6455 2.6760 2.6770 1.6904 1.6812 1.6757 1.3249 1.4638 1.7735 1.6153 1.6597 1.7615 3.1632 2.3618 1.3775 1.7829 1.6532 1.2992 1.3229 1.5150 1.4940 1.1960 1.1963 1.6855 1.3639 2.1539 2.9029 2.7950 2.5979 1.0473 1.0470 1.0481 1.0560 1.0535 1.0656 1.1501 1.1541 2.1738 2.3756 6.5778 6.6183 6.3860 6.3881 1.0349 1.0349 1.0354 1.0353 1.0821 1.0854 1.0859 1.0999 1.0999 1.0982 1.0991 1.0992 1.1004 1.0993 1.0992 1.0876 1.0884 1.0961 1.0950 1.0905 1.0900 1.0660 1.0660
irintensity: 0.0343 0.0298 0.2042 0.2078 0.3610 0.0267 0.0705 0.3165 1.5755 0.9073 1.6079 0.4590 0.3686 0.3009 0.4977 0.0405 0.9902 2.0793 0.0810 0.9065 0.5888 3.1085 0.7291 0.4289 0.6997 1.0149 2.9478 1.0072 11.3180 86.6092 107.7433 44.8552 1.4811 3.0557 3.8404 7.5544 4.2879 21.6351 18.7322 26.4561 18.2314 11.4728 18.5838 33.4268 63.9043 11.9006 87.5584 63.7539 7.3153 11.8237 0.9078 16.9472 5.9943 30.7456 37.4816 81.1285 4.5672 2.0689 5.3054 7.7238 1.7402 2.8621 9.6774 18.1292 3.8684 4.5108 0.3558 0.2237 22.1700 131.9076 52.4603 43.4395 25.5514 3.2465 8.4179 43.4776 116.3910 60.2266 26.8551 2.5495 3.2536 15.2231 7.6073 33.7068 42.5032 114.3422 14.7797 32.2183 19.9407 0.4456 4.4725 2.5951 3.0899 13.8524 14.2573 1.3069 1.9750 20.6285 9.8436 14.2756 19.0108 0.2533 1.5170 4.1217 9.8485 11.3272 10.1671 5.3482 7.5225 111.3680 70.3933 7.5490 2.2726 25.6698 10.7052 34.1253 26.2571 28.8022 27.9280 5.8642 0.5873 0.8655 1.8874 2.2241 99.9646 58.9898 89.7829 21.7418 31.3758 31.4708 21.0126 21.2688 14.1784 13.6693 0.9620 1.6718 45.6636 37.6589
temp: 298.150 k
press: 1.00000 atm
elementType: 17 17 17 8 8 6 6 6 6 6 6 6 6 6 6 6 6 6 6 6 6 6 6 6 6 1 1 1 1 1 1 1 1 1 1 1 1 1 1 1 1 1 1 1 1 1 1 1
symmnumber: 1
zpe: 990773.1 jmol-1
zpe.correction: 0.377366 hartree
zpe.thermalcorrener: 0.402798 hartree
zpe.thermalcorrenthalpy: 0.403742 hartree
zpe.thermalcorrgfe: 0.321528 hartree
zpe.sumelectzpe: -2304.688562 hartree
zpe.sumelectthermal: -2304.663130 hartree
zpe.sumelectthermalent: -2304.662186 hartree
zpe.sumelectthermalfe: -2304.744400 hartree
dipole: 0.7588 -1.3526 3.7552
dipole: 4.0629
quadrupole: -153.6364 -177.6921 -155.5944
quadrupole: 5.1391 0.9415 5.4588
quadrupole: 8.6713 -15.3845 6.7132 5.1391 0.9415 5.4588
hfenergy: -2305.0659277 hartree
pointgroup: C01 [X(C20H23Cl3O2)]
dipole: -0.2936035 -0.3594936 -1.5295901 debye
polarizability: 299.4497932|-13.641876|251.2389602|6.7810797|-21.6692712|219.2787787 unknown
InChI: InChI=1S/C20H23Cl3O2/c1-11(2)15-9-13(5-7-17(15)24)19(20(21,22)23)14-6-8-18(25)16(10-14)12(3)4/h5-12,19,24-25H,1-4H3
charge 0 multiplicity 1
48 atoms
Cl -0.216118 1.714354 2.49897
Cl -1.244316 4.04533 0.901953
Cl 1.721204 3.52976 1.035947
O  -5.06951 -0.976247 -0.888212
O  4.389251 -1.612998 -1.746085
C  -0.045656 1.837418 -0.383356
C  -1.384251 1.088654 -0.507548
C  1.168885 0.943547 -0.678585
C  -2.794576 -0.906385 -0.072554
C  2.862052 -0.768359 -0.071486
C  -2.982123 -2.286105 0.562271
C  3.512329 -1.672246 0.978385
C  -1.57539 -0.202406 0.041744
C  1.789146 0.089274 0.265463
C  0.054539 2.684106 0.920914
C  -2.454727 1.684213 -1.217352
C  1.653343 0.931124 -2.009537
C  -3.852014 -0.271926 -0.779687
C  3.317576 -0.755916 -1.416477
C  -3.683254 1.009004 -1.356281
C  2.719056 0.088703 -2.380623
C  -3.040846 -2.167033 2.110485
C  -1.881524 -3.286839 0.124106
C  2.481481 -2.648466 1.606093
C  4.219547 -0.832826 2.076516
H  -0.045998 2.621369 -1.167075
H  -3.955578 -2.678966 0.218649
H  4.281323 -2.276022 0.464908
H  -0.746913 -0.68596 0.567918
H  1.447836 0.098354 1.305075
H  -2.334338 2.680313 -1.657005
H  1.193644 1.580037 -2.764253
H  -4.50726 1.479196 -1.909135
H  3.084223 0.092054 -3.416203
H  -3.856474 -1.492306 2.426487
H  -3.213855 -3.158706 2.568693
H  -2.092384 -1.764477 2.513813
H  -1.846528 -3.385943 -0.975805
H  -2.081389 -4.285473 0.555144
H  -0.878763 -2.969957 0.467811
H  1.693197 -2.102783 2.158757
H  2.982466 -3.326839 2.321292
H  1.991562 -3.265506 0.830849
H  3.496653 -0.201455 2.626251
H  4.716093 -1.496748 2.808642
H  4.984785 -0.167768 1.637934
H  -5.732711 -0.448042 -1.397648
H  4.621003 -1.527006 -2.703757
