program: Gaussian 09
title: 000208215
version: EM64L-G09RevD.01
frameworkgroup: C1[X(C12H14N2O5S2)]
method: RPBEPBE
basis: SDD
operation: Freq
keyword: #p
keyword: freq=noraman
keyword: PBEPBE/SDD
title: #p freq=noraman PBEPBE/SDD
converged: YES YES NO NO
title: Mulliken charges:
elementType: S S O O O O O N N C C C C C C C C C C C C H H H H H H H H H H H H H H
charge: 0.109385 0.967652 -0.198804 -0.199514 -0.556317 -0.488607 -0.498125 -0.228512 -0.282041 -0.354757 -0.372315 0.186211 0.178407 0.092721 0.086309 -0.271906 -0.352594 -0.351958 -0.758123 -0.210046 -0.209624 0.255929 0.237466 0.224328 0.248828 0.273782 0.226021 0.229750 0.270992 0.270919 0.310090 0.302136 0.240665 0.240764 0.380888
chargesum: 0.00000
title: Mulliken charges with hydrogens summed into heavy atoms:
elementType: S S O O O O O N N C C C C C C C C C C C C
charge: 0.109385 0.967652 -0.198804 -0.199514 -0.175429 -0.488607 -0.498125 -0.228512 -0.008259 0.138638 0.100841 0.186211 0.178407 0.092721 0.086309 0.183865 -0.081602 -0.081039 -0.145897 0.030619 0.031141
polarizability: 4.48265766e+02 8.93617829e+00 2.11645291e+02 3.27097819e+00 3.62811448e+00 1.36811955e+02
1716.lowfreq: -8.1623 -2.0875 -0.0026 -0.0020 -0.0008 2.5221 9.1596 11.9437 22.0032
frequency: 8.7632 11.1637 21.8342 28.9926 32.9526 53.7799 66.5585 112.8543 117.5956 125.0688 137.8207 140.5150 160.8443 179.0945 184.8726 199.1122 214.8093 231.6022 247.3238 262.4438 289.2296 301.1581 309.0398 332.8057 380.0730 402.8755 404.9318 430.3356 455.6440 522.8513 525.4888 539.3063 604.0790 629.8351 659.1439 678.6012 693.8944 702.5839 718.1865 743.7213 776.0728 786.2478 796.5689 829.8058 855.5382 907.2742 938.7447 951.8251 975.3337 981.4752 991.8265 1007.2547 1015.3084 1030.8590 1039.7741 1057.1874 1072.5939 1074.1974 1115.1709 1161.2456 1169.0815 1171.3016 1189.8202 1205.2344 1242.1154 1269.9540 1284.2369 1291.1889 1306.9425 1321.0897 1344.1302 1359.0979 1387.1439 1416.3307 1419.9636 1447.4139 1453.8407 1455.8687 1462.9464 1478.3750 1490.2227 1614.5370 1618.0298 1629.1029 1677.1777 2907.1813 2924.7046 2956.3873 3019.1594 3033.7448 3044.5024 3057.7301 3092.2657 3140.7767 3154.0287 3165.4255 3175.4208 3454.3107 3457.0213
redmass: 7.5288 8.4184 7.1243 6.9070 8.8314 3.9735 3.9168 2.5063 5.1258 2.4148 5.0016 8.2842 3.0830 4.6287 2.4829 4.4372 5.1566 4.4849 4.6497 3.4466 9.0535 5.6441 6.6840 10.0556 5.6956 5.8050 4.5131 3.7133 4.8611 7.2242 17.8318 7.1767 7.7944 1.3239 4.7988 5.2014 5.5240 4.6451 3.0382 1.2168 1.4511 4.6129 1.6837 15.6386 3.9696 1.3918 9.9568 6.6119 1.4126 1.6942 2.9711 1.3485 2.1457 3.2331 2.5884 1.2235 2.7263 3.5436 1.3178 3.2906 1.2261 2.0156 1.6950 3.0248 1.3564 1.2398 1.4848 1.1173 1.2884 1.2091 3.0194 1.6774 1.3419 5.9157 1.0820 1.2787 2.4622 2.0903 1.2405 1.0804 1.0790 7.6781 7.9801 11.4691 11.8098 1.0698 1.0691 1.0640 1.0606 1.0909 1.0889 1.0981 1.1052 1.0865 1.0906 1.0957 1.1004 1.0662 1.0747
irintensity: 0.2180 0.1511 0.1206 0.3145 1.5704 0.7641 4.5329 6.1230 1.3748 24.4434 0.0522 12.8849 7.9916 9.2740 55.9211 1.2606 59.5845 0.1841 12.9030 6.1190 23.1414 0.1334 19.2532 10.5719 29.9272 25.1821 40.4017 54.6514 0.0078 8.5577 183.7477 7.4107 15.8296 244.1935 0.0194 2.3116 2.0813 24.8017 54.2035 15.8351 7.8473 0.5776 30.6320 94.4404 20.4207 0.0120 75.9866 11.7907 2.0690 7.3988 44.1734 0.0019 6.2209 14.7502 14.9818 64.9185 11.4047 1.9103 73.3394 35.5836 3.9869 3.7686 105.7658 15.2887 37.9046 63.6332 0.5731 20.6638 55.0450 18.7298 287.1982 109.4594 74.7502 14.2237 14.8008 23.8723 12.0937 11.1122 22.4597 2.5204 27.4299 3.4795 91.7516 350.5361 36.5638 75.4787 37.5725 3.3827 20.6519 16.8450 13.7097 8.6871 5.1361 1.6129 4.9967 5.3072 23.3012 78.0365 27.5867
temp: 298.150 k
press: 1.00000 atm
elementType: 16 16 8 8 8 8 8 7 7 6 6 6 6 6 6 6 6 6 6 6 6 1 1 1 1 1 1 1 1 1 1 1 1 1 1
symmnumber: 1
zpe: 661019.9 jmol-1
zpe.correction: 0.251769 hartree
zpe.thermalcorrener: 0.274369 hartree
zpe.thermalcorrenthalpy: 0.275313 hartree
zpe.thermalcorrgfe: 0.193993 hartree
zpe.sumelectzpe: -1745.700581 hartree
zpe.sumelectthermal: -1745.677981 hartree
zpe.sumelectthermalent: -1745.677037 hartree
zpe.sumelectthermalfe: -1745.758357 hartree
dipole: 6.5375 -0.1838 1.8548
dipole: 6.7980
quadrupole: -132.6121 -146.3306 -135.6831
quadrupole: 1.5253 2.4805 -5.5656
quadrupole: 5.5965 -8.1220 2.5255 1.5253 2.4805 -5.5656
hfenergy: -1745.9523501 hartree
pointgroup: C01 [X(C12H14N2O5S2)]
dipole: 2.5793257 0.0972363 -0.7005801 debye
polarizability: 448.4941351|-5.8713056|211.5279739|0.4364829|2.582377|136.7009026 unknown
InChI: InChI=1S/C12H13N2O2S.HO3S/c15-11-9-3-1-2-4-10(9)12(16)14(11)7-5-13-6-8-17;1-4(2)3/h1-4,13H,5-8H2;1H
charge 0 multiplicity 1
35 atoms
S  -5.57635 -1.661815 -0.150353
S  -6.824709 0.450795 -0.385738
O  2.237874 -2.242637 0.317202
O  2.265429 2.443234 0.785441
O  -6.391777 0.746183 -2.170652
O  -8.433063 0.339639 -0.281708
O  -6.052637 1.56489 0.509095
N  1.930157 0.089397 0.675287
N  -1.841658 -0.070811 0.648898
C  0.56174 0.045545 1.201943
C  -0.488474 -0.097459 0.073004
C  3.996635 -0.547343 -0.191544
C  4.004488 0.862715 -0.052347
C  2.667622 -1.063156 0.270396
C  2.681278 1.292311 0.503841
C  -2.94831 -0.601777 -0.161124
C  5.109745 -1.239594 -0.690562
C  5.125557 1.627128 -0.407516
C  -4.144019 -0.883957 0.767929
C  6.249515 -0.475117 -1.053651
C  6.257368 0.935989 -0.914293
H  0.467407 -0.807687 1.894742
H  0.399551 0.985484 1.760485
H  -0.319324 0.701575 -0.686278
H  -0.344502 -1.070077 -0.431272
H  -2.070711 0.814355 1.119119
H  -2.608638 -1.544009 -0.630107
H  -3.277571 0.073064 -0.984198
H  5.092886 -2.329127 -0.792666
H  5.120673 2.715693 -0.294534
H  -4.52532 0.058349 1.215125
H  -3.875151 -1.568584 1.593389
H  7.137676 -0.980621 -1.447395
H  7.151479 1.498901 -1.202592
H  -7.04957 1.413125 -2.531467
