program: Gaussian 09
title: 000210531
version: EM64L-G09RevD.01
frameworkgroup: C1[X(C18H17N3O4)]
method: RPBEPBE
basis: SDD
operation: Freq
keyword: #p
keyword: freq=noraman
keyword: PBEPBE/SDD
title: #p freq=noraman PBEPBE/SDD
converged: YES YES NO NO
title: Mulliken charges:
elementType: O O O O N N N C C C C C C C C C C C C C C C C C C H H H H H H H H H H H H H H H H H
charge: -0.260263 -0.268658 -0.262330 -0.251843 -0.247199 -0.060012 0.021908 -0.075976 0.123170 0.190480 0.364841 0.176028 -0.242870 -0.527030 -0.067165 -0.363339 -0.361318 -0.362967 -0.243778 -0.230321 -0.310814 0.283752 -0.251053 -0.268902 -0.658699 0.233075 0.248442 0.266023 0.240081 0.295749 0.266184 0.258814 0.268230 0.225554 0.218567 0.250788 0.226717 0.234059 0.225298 0.218797 0.230622 0.247359
chargesum: 0.00000
title: Mulliken charges with hydrogens summed into heavy atoms:
elementType: O O O O N N N C C C C C C C C C C C C C C C C C C
charge: -0.260263 -0.268658 -0.262330 -0.251843 -0.247199 -0.060012 0.021908 -0.075976 0.123170 0.190480 0.364841 0.176028 0.238646 -0.020926 0.228584 -0.097155 -0.102504 -0.094738 -0.018224 -0.011754 -0.060026 0.283752 -0.024337 0.190455 0.038079
polarizability: 3.63261596e+02 -5.65237272e+01 2.78675718e+02 -1.14956871e+01 2.37311800e+00 1.26720642e+02
1716.lowfreq: -4.3112 0.0003 0.0004 0.0007 3.7075 4.1407 13.3489 19.8601 37.6204
frequency: 13.1932 19.8040 37.6149 40.3112 56.2513 64.9076 76.7718 78.3670 103.9264 118.4696 123.9317 166.7477 181.5570 190.3824 230.2682 242.5193 259.3869 277.7223 281.8898 308.2195 320.2026 372.8944 380.2995 387.5585 404.2054 440.6254 448.1460 498.9352 511.8968 532.0661 560.3044 564.2187 582.8298 615.2403 626.7265 646.5793 662.6918 669.5978 695.8256 710.3121 720.5330 755.6194 769.1161 777.0703 805.4777 817.5322 827.4077 841.1759 847.1783 859.3298 879.3169 909.3475 925.6918 954.0547 969.7116 975.1478 988.9516 992.4622 997.4203 1000.7788 1011.4901 1016.6625 1040.1493 1072.2466 1086.1052 1088.5882 1096.4569 1137.1282 1152.0647 1158.5135 1170.8925 1175.5056 1196.1905 1205.1845 1222.7789 1232.9105 1270.2102 1278.7657 1297.5736 1306.4796 1330.9479 1341.5022 1349.5683 1366.7073 1374.6240 1389.9975 1390.8351 1400.3310 1424.0450 1426.1335 1445.2309 1458.8682 1461.3414 1462.2981 1483.2345 1484.6708 1495.3115 1511.1960 1578.7012 1579.7263 1608.9248 1625.2732 1644.2161 2992.8920 3008.1610 3029.3501 3030.9379 3080.3627 3088.2950 3093.4121 3102.6819 3119.6179 3123.4386 3136.7446 3154.2016 3161.8191 3172.7547 3176.8384 3183.8084 3198.2371
redmass: 4.6601 5.3429 5.2620 6.9494 4.0582 4.0349 4.2247 3.8544 5.2699 4.9399 5.0689 7.8641 3.5469 1.7929 1.9758 2.3748 5.7477 4.7195 5.1432 3.9134 4.2235 5.6354 5.2131 4.4892 2.9090 3.7594 4.3219 5.6239 4.1089 5.8773 3.6546 5.6112 8.5533 6.3852 3.5133 6.9443 9.3401 7.5483 1.7921 4.0691 6.4621 3.5110 2.1107 3.3806 4.4125 1.5403 1.3336 3.7662 1.3441 3.0841 7.5112 1.4402 1.4354 1.3381 3.1759 1.3997 4.9970 1.3852 2.4605 2.4122 3.8585 2.5290 2.2302 7.0472 2.6940 1.7756 2.1653 3.2507 3.4723 1.6792 1.9847 1.1746 1.1752 1.1331 2.1190 1.2313 5.1738 1.1188 2.6861 2.1771 1.5000 1.3877 1.4040 1.6708 4.7795 1.2374 3.3145 2.0513 1.8448 1.4361 2.6348 1.0942 1.1878 1.0612 1.3958 1.6053 10.1183 5.0905 5.8925 5.7365 6.0142 11.0749 8.9115 1.0358 1.0639 1.0599 1.0587 1.0970 1.0976 1.1028 1.1067 1.1061 1.0849 1.0900 1.0963 1.0921 1.0956 1.0886 1.0957 1.1000
irintensity: 0.6386 1.4010 0.0982 0.6486 0.3011 1.2970 1.9762 0.7471 0.5093 0.6448 2.5649 4.7363 0.6258 5.9403 3.5896 2.3443 0.1781 2.1305 0.3294 4.6116 13.5875 2.0734 0.8550 15.4257 0.1932 3.5500 4.5397 15.9781 15.0002 2.5054 8.5477 9.0559 15.6374 0.7220 4.8274 5.4550 1.3609 4.6460 48.6736 1.9545 3.2379 7.0874 11.5700 36.8419 11.6339 4.2628 49.3771 1.5489 2.9343 2.7144 28.9033 4.1401 3.0389 0.4751 13.6114 0.6917 1.2725 0.6371 2.4291 10.6431 65.8026 50.9265 38.1525 1.8734 36.1768 12.3129 34.4827 385.3402 53.1990 17.4396 32.6277 10.6031 32.8045 16.9489 64.5091 4.1116 74.4858 5.5232 63.8313 91.2142 25.1237 10.5601 63.4950 61.7282 1.1540 18.9944 34.3546 42.5123 61.9699 20.8483 11.5461 16.6593 22.5007 23.6999 11.0702 44.8189 71.1257 168.0352 19.9939 4.5769 36.2627 325.1229 144.3048 13.3746 6.2581 34.2045 26.9161 3.6115 50.2115 0.6565 11.3170 36.0861 0.2752 22.7440 43.3607 3.4946 12.4469 10.0936 7.5799 6.9777
temp: 298.150 k
press: 1.00000 atm
elementType: 8 8 8 8 7 7 7 6 6 6 6 6 6 6 6 6 6 6 6 6 6 6 6 6 6 1 1 1 1 1 1 1 1 1 1 1 1 1 1 1 1 1
symmnumber: 1
zpe: 842289.8 jmol-1
zpe.correction: 0.320811 hartree
zpe.thermalcorrener: 0.343134 hartree
zpe.thermalcorrenthalpy: 0.344078 hartree
zpe.thermalcorrgfe: 0.266060 hartree
zpe.sumelectzpe: -1159.476713 hartree
zpe.sumelectthermal: -1159.454390 hartree
zpe.sumelectthermalent: -1159.453446 hartree
zpe.sumelectthermalfe: -1159.531463 hartree
dipole: -2.5410 -1.6494 1.4333
dipole: 3.3514
quadrupole: -122.6846 -144.6627 -147.7068
quadrupole: 2.5874 2.2035 -2.7872
quadrupole: 15.6668 -6.3113 -9.3554 2.5874 2.2035 -2.7872
hfenergy: -1159.7975238 hartree
pointgroup: C01 [X(C18H17N3O4)]
dipole: -0.8884473 0.9169322 -0.3292696 debye
polarizability: 372.8351616|34.7207992|249.8912367|38.6411731|45.8128619|145.9315568 unknown
InChI: InChI=1S/C18H17N3O4/c1-2-24-15(22)8-11-25-17-16(13-6-4-3-5-7-13)18(23)21-10-9-19-12-14(21)20-17/h3-7,9-10,12H,2,8,11H2,1H3
charge 0 multiplicity 1
42 atoms
O  -0.468789 1.134126 -0.42157
O  2.625171 -2.587071 -0.50322
O  -4.359708 2.272261 -0.021107
O  -2.800231 1.849286 1.663731
N  3.286067 -0.435058 0.168748
N  1.757477 1.422253 0.225033
N  5.329943 1.298318 1.073216
C  0.922303 -0.823226 -0.435945
C  0.77025 0.573136 -0.192297
C  2.248849 -1.395131 -0.298278
C  -0.2089 -1.707408 -0.825526
C  2.988829 0.920765 0.414195
C  -0.642408 2.583844 -0.12795
C  -2.095552 2.899343 -0.46644
C  4.578602 -0.914101 0.370404
C  -0.010316 -2.778252 -1.744222
C  -1.509189 -1.528764 -0.269124
C  4.082972 1.743469 0.872784
C  -1.078332 -3.624372 -2.108502
C  -2.569635 -2.386556 -0.625815
C  5.566361 -0.052298 0.815589
C  -3.075825 2.275338 0.518874
C  -2.363722 -3.435982 -1.551326
C  -5.451283 1.712689 0.839856
C  -5.524069 0.1897 0.703761
H  0.05845 3.165831 -0.750463
H  -0.417008 2.760862 0.937123
H  -2.346325 2.567149 -1.487999
H  -2.241863 3.997239 -0.442668
H  4.711764 -1.976178 0.15313
H  0.984337 -2.951336 -2.161413
H  -1.684609 -0.72298 0.448765
H  3.866462 2.798173 1.066748
H  -0.90304 -4.436902 -2.822434
H  -3.558503 -2.23819 -0.177065
H  6.584975 -0.408375 0.982537
H  -3.190449 -4.099682 -1.829066
H  -5.263082 2.014589 1.885364
H  -6.357462 2.207838 0.456454
H  -6.399666 -0.190919 1.261679
H  -5.6314 -0.105858 -0.35417
H  -4.618846 -0.282673 1.120408
