program: Gaussian 09
title: 000208208
version: EM64L-G09RevD.01
frameworkgroup: C1[X(C15H20N4O2S)]
method: RPBEPBE
basis: SDD
operation: Freq
keyword: #p
keyword: freq=noraman
keyword: PBEPBE/SDD
title: #p freq=noraman PBEPBE/SDD
converged: YES YES NO NO
title: Mulliken charges:
elementType: S O O N N N N C C C C C C C C C C C C C C C H H H H H H H H H H H H H H H H H H H H
charge: 0.143642 -0.202203 -0.201043 -0.215655 -0.299525 -0.606753 -0.325202 -0.338785 -0.394154 -0.388010 0.183419 0.184983 0.078561 0.077552 -0.347781 -0.325810 -0.356803 -0.355713 -0.685846 -0.211788 -0.211776 -0.078371 0.261492 0.231231 0.228740 0.203018 0.220881 0.205965 0.238424 0.229832 0.179409 0.223926 0.217846 0.269020 0.269041 0.255281 0.299343 0.237896 0.237819 0.327887 0.316820 0.223191
chargesum: 0.00000
title: Mulliken charges with hydrogens summed into heavy atoms:
elementType: S O O N N N N C C C C C C C C C C C C C C C
charge: 0.143642 -0.202203 -0.201043 -0.215655 -0.061101 0.037954 -0.102011 0.153938 0.037604 0.038836 0.183419 0.184983 0.078561 0.077552 0.061459 0.115962 -0.087783 -0.086672 -0.131223 0.026108 0.026042 -0.078371
polarizability: 2.95901524e+02 -1.33885788e+01 2.15810351e+02 1.80340122e+01 -1.69512024e-01 1.37939560e+02
1716.lowfreq: -3.8102 -0.9235 -0.0012 0.0003 0.0012 6.8133 10.1045 12.5969 19.0598
frequency: 9.7291 12.5084 19.0493 29.3800 30.9007 48.7494 59.3252 91.3641 103.2372 114.1217 137.4273 145.5710 164.2949 177.4727 217.5562 234.0031 241.0017 246.4903 262.2381 316.0724 330.5931 336.5206 384.0139 396.3224 396.9642 416.9537 436.3783 456.1051 456.6113 475.2148 522.2753 532.2879 558.1719 587.0754 588.4038 646.0687 659.3511 678.6940 690.4738 698.3741 712.9319 723.7488 740.1662 784.9143 793.2779 807.2240 837.4059 847.8449 866.5065 905.7181 908.0187 952.6013 973.2549 985.5144 1001.6516 1005.2388 1012.8340 1028.2847 1041.4441 1052.5752 1063.2154 1072.1109 1078.4239 1090.2585 1110.7511 1147.0959 1157.3272 1167.1041 1170.6703 1201.3906 1223.6317 1247.0546 1252.8118 1278.6419 1282.0217 1284.1014 1290.4839 1309.8051 1316.6264 1325.7149 1344.6752 1349.2338 1357.1605 1389.1197 1416.1524 1419.1924 1445.7137 1451.2831 1453.1350 1459.8099 1465.1444 1467.2917 1479.8599 1493.7207 1613.2050 1615.8288 1616.3981 1624.7911 1640.7481 1673.8575 2861.0889 2888.9478 2988.4156 2992.9007 3009.4535 3018.0667 3020.2163 3027.1892 3053.5301 3060.0088 3085.6025 3101.6742 3138.3969 3151.7968 3163.2887 3173.5595 3367.8951 3430.7582 3527.1988 3676.0663
redmass: 5.1681 6.5475 7.2252 4.6053 5.0639 6.0194 4.9449 3.3071 1.9655 3.5626 5.0154 4.9538 3.5506 5.1563 3.1593 4.7887 3.3213 3.4112 3.4026 3.3128 2.7756 1.3279 3.5034 2.9164 1.3323 3.3887 3.2229 4.9500 5.2545 2.8106 6.5620 3.8870 3.1421 5.5631 3.2422 1.4875 4.8053 6.1142 5.7863 3.9706 2.9200 1.4086 1.1388 5.2794 1.6140 2.0524 2.9890 1.3663 3.0129 1.4021 2.1821 3.3672 1.4135 1.7291 3.2089 1.3466 2.0908 2.7311 1.6072 2.5801 2.0519 2.5889 2.2775 1.7652 2.5386 1.4092 2.2325 1.1984 2.0251 2.7031 1.3344 1.2984 1.3622 2.6781 1.4510 1.2562 1.0954 1.3748 1.3381 2.1244 1.6784 1.3669 1.5488 1.3994 6.1440 1.0974 1.1689 1.8816 2.4608 1.3573 1.0937 1.1280 1.0843 1.0854 1.3685 7.9205 8.3391 9.8237 3.2839 11.5798 1.0706 1.0716 1.0624 1.0631 1.0847 1.0601 1.0576 1.0875 1.0992 1.1023 1.1055 1.1072 1.0863 1.0905 1.0956 1.1004 1.0770 1.0742 1.0448 1.1043
irintensity: 1.1881 0.3191 0.1403 8.4483 2.8072 3.0523 2.2167 0.9888 3.1989 0.8346 0.1410 3.2763 7.7376 0.9917 3.6634 0.8818 0.9818 12.6318 6.2428 8.5361 16.6411 27.9488 4.3429 35.0713 251.7907 4.0453 7.8772 0.3825 1.0442 1.1458 9.4009 4.6355 19.9354 25.7699 40.2110 81.8975 0.0738 1.6883 6.9108 27.0819 73.4771 85.5499 12.9169 0.1418 36.5327 12.5760 8.4121 4.8120 12.3635 0.4452 14.4846 24.6684 2.0384 138.4650 52.4357 0.1276 0.7461 3.2060 7.8832 16.1086 1.9554 9.8819 2.6729 4.4356 7.2956 2.5781 73.6892 8.8692 8.4134 10.2355 5.5834 10.3935 26.6955 204.3456 1.7518 4.0974 1.7701 37.3645 33.6383 151.9202 65.3966 34.6702 50.5752 1.4266 9.7826 23.3757 27.2370 9.4994 10.5882 15.7537 6.2103 4.4441 11.9256 6.0967 113.0523 61.0225 158.9210 246.5357 250.5637 57.6564 93.5101 122.1500 29.8975 10.1840 10.0027 22.7955 32.4310 20.8552 58.4139 22.7372 2.4164 6.9953 1.7056 5.4267 6.6755 22.7833 22.5443 1.1193 34.7566 22.1601
temp: 298.150 k
press: 1.00000 atm
elementType: 16 8 8 7 7 7 7 6 6 6 6 6 6 6 6 6 6 6 6 6 6 6 1 1 1 1 1 1 1 1 1 1 1 1 1 1 1 1 1 1 1 1
symmnumber: 1
zpe: 882067.2 jmol-1
zpe.correction: 0.335962 hartree
zpe.thermalcorrener: 0.358786 hartree
zpe.thermalcorrenthalpy: 0.359731 hartree
zpe.thermalcorrgfe: 0.278295 hartree
zpe.sumelectzpe: -1349.481725 hartree
zpe.sumelectthermal: -1349.458901 hartree
zpe.sumelectthermalent: -1349.457957 hartree
zpe.sumelectthermalfe: -1349.539392 hartree
dipole: -1.2615 -0.6149 0.9165
dipole: 1.6761
quadrupole: -82.7542 -135.0645 -139.6950
quadrupole: -27.3465 9.8217 0.6640
quadrupole: 36.4171 -15.8933 -20.5238 -27.3465 9.8217 0.6640
hfenergy: -1349.8176871 hartree
pointgroup: C01 [X(C15H20N4O2S1)]
dipole: 0.5146435 -0.2791841 -0.3034044 debye
polarizability: 293.697505|19.7228304|215.0797316|19.3998236|-11.7136023|140.8741981 unknown
InChI: InChI=1S/C15H20N4O2S/c16-15(17)22-10-4-8-18-7-3-9-19-13(20)11-5-1-2-6-12(11)14(19)21/h1-2,5-6,16,18H,3-4,7-10,17H2
charge 0 multiplicity 1
42 atoms
S  5.96749 -0.966368 1.131408
O  -0.776114 -1.017724 0.662898
O  -4.096807 2.285405 0.127497
N  -2.190543 0.891803 0.43001
N  1.566463 1.550879 -0.541883
N  8.356096 0.214158 0.8072
N  6.824928 0.433667 -1.075927
C  -1.203525 1.966887 0.649621
C  -0.688114 2.585859 -0.66995
C  0.346587 1.674938 -1.368261
C  -3.219038 -1.191439 0.22077
C  -4.218344 -0.202655 0.054917
C  -1.90655 -0.505484 0.464476
C  -3.57425 1.144194 0.190624
C  2.37368 0.327467 -0.748696
C  3.593961 0.327068 0.197384
C  -3.523421 -2.558728 0.150523
C  -5.556522 -0.546937 -0.185859
C  4.466437 -0.918284 -0.015943
C  -4.874897 -2.918853 -0.093687
C  -5.875979 -1.928282 -0.259324
C  7.16115 0.025515 0.116266
H  -0.344979 1.532614 1.192534
H  -1.691438 2.735864 1.273903
H  -1.538374 2.803008 -1.343963
H  -0.213112 3.557923 -0.430349
H  -0.078873 0.661104 -1.491297
H  0.54635 2.059729 -2.397147
H  2.147489 2.39977 -0.588154
H  1.72404 -0.540076 -0.521046
H  2.730084 0.21136 -1.803446
H  3.235657 0.382485 1.241566
H  4.214736 1.224106 0.005259
H  -2.742455 -3.314247 0.281884
H  -6.320561 0.226811 -0.310427
H  3.922213 -1.855206 0.194751
H  4.887488 -0.939566 -1.03573
H  -5.15111 -3.9770 -0.154889
H  -6.910397 -2.236135 -0.446159
H  8.48024 -0.143763 1.752784
H  9.127219 0.715943 0.371753
H  7.548792 0.97529 -1.583892
