program: Gaussian 09
title: 000210516
version: EM64L-G09RevD.01
frameworkgroup: C1[X(C17H21ClNO)]
method: RPBEPBE
basis: SDD
operation: Freq
keyword: #p
keyword: freq=noraman
keyword: PBEPBE/SDD
title: #p freq=noraman PBEPBE/SDD
converged: YES YES NO NO
title: Mulliken charges:
elementType: Cl O N C C C C C C C C C C C C C C C C C H H H H H H H H H H H H H H H H H H H H H
charge: -0.015855 -0.340768 -0.052360 -0.128360 -0.507465 0.079493 0.488781 -0.384553 -0.704393 -0.305777 -0.454782 -0.676718 -0.063116 -0.122572 -0.133367 -0.193413 -0.222627 -0.201725 -0.179655 -0.138331 0.221772 0.272216 0.290030 0.220013 0.196240 0.216326 0.217716 0.212444 0.245670 0.275329 0.243064 0.201769 0.221313 0.235618 0.322658 0.286117 0.252298 0.276578 0.280888 0.280169 0.289338
chargesum: 1.00000
title: Mulliken charges with hydrogens summed into heavy atoms:
elementType: Cl O N C C C C C C C C C C C C C C C C C
charge: -0.015855 -0.340768 -0.052360 0.093413 0.054781 0.299505 0.488781 0.028013 -0.028563 -0.030449 -0.211719 -0.018018 0.259543 0.163545 -0.133367 0.058884 0.053951 0.079162 0.100514 0.151008
polarizability: 2.71712989e+02 -4.42362421e+00 1.74807442e+02 -7.78121303e+00 -3.17800820e+01 1.58555150e+02
1716.lowfreq: -25.6455 -1.3002 -0.0013 0.0013 0.0018 3.7528 13.6134 23.3761 27.8243
frequency: -18.2405 23.3399 27.7878 39.5979 50.6269 67.1126 89.1757 105.8979 131.9842 150.1282 181.5448 190.2199 217.1437 219.3418 238.5446 265.2154 295.6783 334.0577 363.0487 378.4143 392.0777 398.5676 434.3677 445.4644 473.8340 481.6403 513.6491 548.4245 592.7546 631.3415 643.1267 676.0725 688.6350 696.8190 731.6022 772.8386 792.6134 801.7662 808.2877 843.3110 851.3085 889.2215 898.5466 914.8496 924.1092 939.5838 963.0072 979.0171 984.8131 988.5448 991.9918 1014.1489 1017.9901 1022.1124 1035.6240 1048.3348 1051.6164 1072.7649 1087.7917 1101.2746 1112.0014 1119.0846 1153.8477 1177.0014 1182.0116 1182.5628 1196.8249 1221.1006 1227.2968 1262.5490 1263.3870 1298.2531 1300.6830 1315.5018 1338.1383 1342.8365 1356.2220 1360.6759 1377.1333 1383.9156 1390.9313 1393.4400 1426.3620 1452.5916 1454.1951 1461.7725 1470.1630 1476.3470 1476.9775 1478.6090 1485.7198 1489.9665 1570.4301 1581.0516 1600.5037 1626.8658 2956.0351 2979.2329 2986.0359 2986.9255 2990.8175 3040.2240 3048.3264 3079.8745 3081.6326 3089.7264 3090.8199 3122.6578 3127.7495 3153.2191 3160.4058 3176.1618 3181.1003 3187.8931 3196.1164 3205.7569 3223.0823
redmass: 3.0751 6.2732 4.3181 4.5639 4.3559 3.8147 2.6946 4.0686 2.6368 3.8190 4.3809 1.6691 1.2385 1.9783 4.5213 2.9104 4.9797 3.3640 3.1923 2.5448 9.5914 2.6773 2.8361 2.9392 2.9960 3.6349 4.0338 3.4984 5.2302 5.9512 6.2090 4.8168 1.9398 2.3048 1.9373 1.7991 1.8397 1.4717 2.6079 2.0212 1.2796 3.5253 1.5198 1.3848 2.6206 1.4038 1.3000 1.3973 5.7401 1.3669 1.4483 5.1055 3.4888 1.3663 3.2980 3.5009 2.3547 2.1013 1.6336 1.7032 1.7913 2.2651 4.3019 1.8740 1.0850 1.1481 2.2822 1.2014 1.3345 1.2400 1.2720 1.2539 1.2726 1.2497 1.3402 1.2516 1.5608 1.6412 2.3928 6.1279 1.2147 1.2327 2.3884 1.2891 1.0787 2.3377 1.0623 1.1681 1.8096 1.0425 1.0561 1.5211 5.7955 6.3645 6.6820 5.0760 1.0834 1.0699 1.0382 1.0409 1.0707 1.0993 1.0598 1.0989 1.1004 1.0994 1.0995 1.1071 1.0898 1.0921 1.0918 1.0907 1.0983 1.0916 1.0963 1.1009 1.0996
irintensity: 0.2924 0.1426 0.5930 0.5565 0.1225 1.7419 1.3950 3.4597 0.9459 2.2497 0.8213 0.1405 0.3727 0.4557 3.6009 5.3596 3.2752 5.1869 0.7445 1.6461 5.1359 0.8220 9.0132 0.4969 2.7739 4.1513 7.5125 9.4907 5.3068 0.9560 0.8613 37.6306 50.2677 38.8828 8.2442 31.1268 52.4263 31.9557 8.5526 5.7119 0.7207 13.1547 13.9939 0.4260 47.3616 0.4044 12.3017 0.2244 3.6737 0.4415 45.9467 6.1945 80.9801 0.7162 6.2253 16.7708 3.3467 23.6855 5.0977 15.6185 10.3434 8.0841 18.8828 6.8240 0.2715 0.9923 54.7227 10.7516 6.9992 4.9745 3.3411 3.8080 0.5777 18.2345 13.9539 9.3281 1.1431 2.8035 1.3430 1.0600 7.0590 37.3875 23.9021 11.7878 4.3594 28.1507 10.3705 19.4975 30.9163 26.5953 19.3635 25.9879 4.1793 44.7495 7.6987 26.6931 27.4529 6.3015 29.9805 1.8124 42.9276 8.0582 4.2019 29.7566 31.8235 40.0116 48.9385 1.5057 5.3524 0.4082 5.0670 0.3413 2.2686 0.1988 1.1670 2.4542 7.5287
temp: 298.150 k
press: 1.00000 atm
elementType: 17 8 7 6 6 6 6 6 6 6 6 6 6 6 6 6 6 6 6 6 1 1 1 1 1 1 1 1 1 1 1 1 1 1 1 1 1 1 1 1 1
symmnumber: 1
zpe: 894707.7 jmol-1
zpe.correction: 0.340776 hartree
zpe.thermalcorrener: 0.359861 hartree
zpe.thermalcorrenthalpy: 0.360805 hartree
zpe.thermalcorrgfe: 0.291380 hartree
zpe.sumelectzpe: -1248.726867 hartree
zpe.sumelectthermal: -1248.707782 hartree
zpe.sumelectthermalent: -1248.706838 hartree
zpe.sumelectthermalfe: -1248.776264 hartree
dipole: -11.7296 -3.5937 0.9299
dipole: 12.3030
quadrupole: -57.9084 -100.8578 -115.3933
quadrupole: 6.5894 12.9099 -5.1802
quadrupole: 33.4781 -9.4713 -24.0068 6.5894 12.9099 -5.1802
hfenergy: -1249.0676434 hartree
pointgroup: C01 [X(C17H21Cl1N1O1)]
dipole: 4.6227721 1.188551 0.8040387 debye
polarizability: 271.6626604|-7.3153152|153.2376422|5.8482751|29.8710985|180.1752784 unknown
InChI: InChI=1S/C17H21ClNO/c1-3-14(2)20-17(13-19-10-5-4-6-11-19)15-8-7-9-16(18)12-15/h4-12,14,17H,3,13H2,1-2H3
charge 1 multiplicity 1
41 atoms
Cl -4.773579 0.589094 -1.624615
O  0.296052 -1.03787 -0.155397
N  2.199219 1.098606 -0.257873
C  0.023096 0.157835 0.641142
C  0.716335 1.303778 -0.142607
C  -0.211126 -2.340489 0.405398
C  -1.461258 0.484607 0.793345
C  -0.10825 -3.353267 -0.747317
C  0.600038 -2.752794 1.643511
C  -2.319488 0.388753 -0.331217
C  -1.977908 0.911822 2.040219
C  -0.997923 -3.019058 -1.96229
C  2.676511 0.165491 -1.15108
C  3.056514 1.801238 0.558564
C  -3.676877 0.725117 -0.184254
C  -3.34527 1.249667 2.162507
C  -4.208532 1.160774 1.047485
C  4.055571 -0.074894 -1.250697
C  4.439586 1.588112 0.492741
C  4.952201 0.639291 -0.424316
H  0.484041 0.075662 1.649524
H  0.534615 2.268073 0.357723
H  0.294731 1.347876 -1.160546
H  -1.277215 -2.18895 0.672912
H  0.9536 -3.4327 -1.055524
H  -0.390638 -4.344145 -0.342244
H  1.6693 -2.869502 1.390414
H  0.507949 -2.027538 2.472256
H  0.23143 -3.722326 2.02351
H  -1.939667 0.025757 -1.292051
H  -1.323239 0.971367 2.918087
H  -0.718671 -2.047885 -2.408195
H  -2.064654 -2.968418 -1.675459
H  -0.899797 -3.792868 -2.743587
H  1.927137 -0.362752 -1.740549
H  2.602795 2.524957 1.23889
H  -3.747308 1.575739 3.126764
H  -5.268533 1.41544 1.135142
H  4.41247 -0.81355 -1.971797
H  5.098997 2.163085 1.146666
H  6.029644 0.465066 -0.494685
