program: Gaussian 09
title: 000210558
version: EM64L-G09RevD.01
frameworkgroup: C1[X(C19H30Cl2N2O3)]
method: RPBEPBE
basis: SDD
operation: Freq
keyword: #p
keyword: freq=noraman
keyword: PBEPBE/SDD
title: #p freq=noraman PBEPBE/SDD
converged: YES YES NO NO
title: Mulliken charges:
elementType: Cl Cl O O O N N C C C C C C C C C C C C C C C C C C C H H H H H H H H H H H H H H H H H H H H H H H H H H H H H H
charge: -0.030611 -0.049825 -0.247004 -0.442848 -0.276983 -0.125705 -0.092571 -0.385614 -0.358250 -0.429500 -0.373392 -0.345657 -0.328590 -0.083463 -0.360234 -0.320943 -0.326049 -0.332449 -0.341612 -0.690564 0.462644 -0.294770 -0.314142 -0.199319 -0.228610 -0.109936 0.212011 0.212665 0.243799 0.177943 0.229148 0.228505 0.198494 0.203953 0.221917 0.190338 0.202879 0.188353 0.224027 0.193921 0.189886 0.213761 0.191566 0.190525 0.212598 0.211142 0.182392 0.234839 0.246415 0.216883 0.209502 0.207160 0.353409 0.296508 0.282243 0.259215
chargesum: 0.00000
title: Mulliken charges with hydrogens summed into heavy atoms:
elementType: Cl Cl O O O N N C C C C C C C C C C C C C C C C C C C
charge: -0.030611 -0.049825 -0.247004 -0.089439 -0.276983 -0.125705 -0.092571 0.039061 0.063492 0.028153 0.029054 0.066598 0.062642 0.140564 0.023573 0.084384 0.077074 0.061086 0.139642 -0.057019 0.462644 -0.294770 -0.017634 0.082924 0.030605 -0.109936
polarizability: 3.28199881e+02 6.02735354e+00 2.62020516e+02 -2.38428286e+00 5.57640047e+00 1.70139745e+02
1716.lowfreq: -6.8043 -4.9089 -3.0721 -0.0016 -0.0014 0.0014 13.7646 16.0907 17.0793
frequency: 13.2118 15.8784 17.0465 26.9232 30.8089 33.5402 44.8180 53.7466 63.9734 75.4640 85.2186 103.6470 111.1702 139.3444 153.2113 164.3757 181.9294 189.2031 196.8450 224.5261 231.9357 236.1404 250.3595 271.8066 287.3777 309.6307 314.6835 315.8675 332.5265 364.1734 375.2572 381.7893 386.5203 396.3457 407.2473 425.7102 441.5973 458.5736 473.7069 491.5745 503.9397 545.4380 558.7034 602.0177 602.7797 635.2718 684.4873 699.8013 735.1876 761.9937 776.2038 788.6045 799.1309 808.5038 811.5875 816.2783 820.6750 840.5118 861.4295 879.9870 901.6875 908.3228 933.8338 938.5944 944.3091 969.1594 993.3213 1002.5060 1024.9551 1028.7197 1039.7302 1048.6587 1053.0516 1061.2815 1070.7020 1084.1437 1086.8907 1088.5770 1108.4274 1113.0793 1118.1480 1127.8425 1136.6182 1148.3451 1159.6311 1185.3095 1190.7778 1211.4226 1221.9794 1223.1550 1238.6991 1247.5607 1252.1184 1256.4559 1262.5317 1269.2903 1271.1034 1285.9287 1291.4144 1300.1422 1302.0823 1325.1592 1329.0674 1337.7806 1348.8286 1349.5527 1353.7788 1354.8087 1359.1433 1367.7315 1370.3259 1374.6166 1376.8177 1386.4809 1389.1592 1399.6866 1444.2838 1448.1740 1451.4178 1456.4897 1458.8035 1460.1315 1462.5723 1467.4352 1471.4293 1474.8144 1477.2304 1477.7172 1485.5064 1490.3540 1566.1275 1591.9236 2847.4868 2854.6162 2868.3723 2871.5524 2905.7524 2914.6048 2951.6893 2956.9130 2961.9874 2969.6420 2972.2095 3003.6984 3017.1411 3017.4577 3022.8475 3026.5930 3032.4746 3035.0657 3035.9830 3044.5366 3050.5013 3068.6042 3072.0242 3078.1470 3083.1987 3094.5515 3156.9956 3177.1341 3181.7855 3543.9486
redmass: 7.8553 4.0993 5.4954 3.7345 5.2276 4.9010 4.8542 4.8607 2.3560 2.7000 4.9440 5.0057 2.6733 5.0775 8.1378 6.0893 3.8876 6.1274 3.4629 1.4378 2.7731 1.8218 2.2043 2.9409 3.0607 3.2279 3.2189 2.3128 7.2584 4.7454 1.4990 2.7705 2.3774 3.3430 2.4338 2.7896 3.1764 2.9126 2.7715 3.5907 4.7582 4.2180 3.0163 4.1477 1.9021 5.0216 5.5178 4.3535 1.3518 2.5616 4.9788 1.3179 2.4683 1.6854 3.2805 1.8664 2.4733 1.5944 1.3826 1.7064 2.2946 2.5723 1.5061 2.3270 1.4214 2.6254 2.3959 2.4114 3.6677 2.3572 3.0467 2.2549 2.1255 2.3811 2.0870 2.5253 2.6181 2.6076 2.3231 1.9045 2.2118 2.3462 2.6893 1.4488 1.7131 2.2302 1.0735 1.5616 1.9055 1.4066 1.3458 1.3242 1.3044 1.4161 1.4145 1.3250 1.2742 1.2098 1.1808 1.3028 1.3076 1.4771 1.3017 1.2611 1.3003 1.3919 3.1154 1.4857 1.4306 1.3435 1.3464 1.3331 1.3399 4.9019 1.2146 1.3994 1.0826 1.0794 1.0972 1.1803 1.2338 1.2300 1.4580 1.0973 1.0855 1.0573 1.0513 1.0788 1.0805 1.0843 7.8555 7.4375 1.0712 1.0704 1.0705 1.0693 1.0693 1.0685 1.0666 1.0667 1.0616 1.0594 1.0382 1.0934 1.0727 1.0809 1.0876 1.0857 1.0884 1.1001 1.0900 1.0872 1.0907 1.1007 1.0992 1.0962 1.0975 1.1072 1.0888 1.0963 1.0938 1.0658
irintensity: 0.0291 0.0995 0.0391 0.0443 0.1117 0.0990 0.9160 0.7699 0.2068 0.1760 0.2579 1.0674 0.8887 0.4117 1.2397 0.2033 3.1989 0.6963 3.1574 2.4837 8.1022 3.2449 0.3091 1.5704 2.6684 7.3108 3.2989 3.4643 10.2632 7.2713 101.5844 24.8912 94.1406 0.4280 23.0257 8.3175 3.1519 6.6409 1.6733 4.7481 3.8830 5.6710 3.8811 27.3166 6.1418 12.4319 37.3535 9.0634 7.8143 12.0896 42.0584 6.8081 15.1280 21.0130 14.8294 10.1826 11.9946 0.6944 21.8971 5.2240 0.3813 25.9913 15.3538 45.0999 15.4144 23.1859 2.7008 32.1082 59.3789 19.1408 11.6182 32.9165 27.4604 55.5485 14.7550 43.8999 2.0549 20.6383 35.7882 9.2586 9.9106 47.7556 36.9591 12.8425 13.9417 5.1779 2.9881 17.3720 96.7142 36.1786 12.6456 7.7193 15.3001 121.6604 19.3547 17.8010 9.2287 4.0662 1.4657 4.7778 2.2174 8.9535 7.0098 9.2052 11.0400 1.6486 21.9235 0.1980 7.4853 5.9286 3.8375 3.7688 3.6526 3.3972 11.0635 1.7559 2.7763 1.2564 20.2888 87.0913 74.0569 45.5785 124.5327 13.9268 8.4390 4.1306 6.5516 4.1573 2.1390 21.9741 16.7211 7.5057 33.3589 62.3656 101.3810 109.0676 48.9381 127.7151 40.3045 104.0412 10.5590 54.9511 61.2827 7.2701 8.3612 32.2175 0.1743 6.1454 28.5549 42.0955 38.4102 47.3786 73.1900 89.9333 46.5144 43.9306 33.7223 7.8497 1.2386 0.8501 0.4534 7.2557
temp: 298.150 k
press: 1.00000 atm
elementType: 17 17 8 8 8 7 7 6 6 6 6 6 6 6 6 6 6 6 6 6 6 6 6 6 6 6 1 1 1 1 1 1 1 1 1 1 1 1 1 1 1 1 1 1 1 1 1 1 1 1 1 1 1 1 1 1
symmnumber: 1
zpe: 1223992.7 jmol-1
zpe.correction: 0.466194 hartree
zpe.thermalcorrener: 0.494708 hartree
zpe.thermalcorrenthalpy: 0.495652 hartree
zpe.thermalcorrgfe: 0.401691 hartree
zpe.sumelectzpe: -1995.195413 hartree
zpe.sumelectthermal: -1995.166900 hartree
zpe.sumelectthermalent: -1995.165955 hartree
zpe.sumelectthermalfe: -1995.259917 hartree
dipole: -1.7590 -3.5612 -0.5536
dipole: 4.0104
quadrupole: -179.7843 -181.2666 -174.0350
quadrupole: 11.1650 3.3978 -5.5463
quadrupole: -1.4223 -2.9047 4.3270 11.1650 3.3978 -5.5463
hfenergy: -1995.6616077 hartree
pointgroup: C01 [X(C19H30Cl2N2O3)]
dipole: 0.2047841 1.5579611 -0.1424015 debye
polarizability: 266.3883421|-13.0463692|277.4877803|60.9629807|-37.833399|216.4840187 unknown
InChI: InChI=1S/C19H30Cl2N2O3/c1-2-3-6-23(8-7-22-9-11-25-12-10-22)14-17(24)15-26-19-5-4-16(20)13-18(19)21/h4-5,13,17,24H,2-3,6-12,14-15H2,1H3
charge 0 multiplicity 1
56 atoms
Cl 0.314746 -3.39349 0.926385
Cl 4.880204 -4.416731 3.912131
O  -5.115897 -2.311224 -2.09341
O  1.849015 1.813635 2.646225
O  1.274548 -0.580319 0.94958
N  -0.823309 2.359225 0.005855
N  -3.156017 -0.53512 -0.875184
C  -2.112201 1.678035 -0.285105
C  -1.889375 0.228681 -0.771578
C  -0.255687 2.016311 1.329769
C  -0.840802 3.824259 -0.259028
C  -2.914263 -1.998491 -0.990133
C  -4.0294 -0.076879 -1.986705
C  1.287513 1.889367 1.284056
C  -0.772955 4.183645 -1.760129
C  -4.250267 -2.756132 -0.98626
C  -5.351153 -0.863504 -1.97897
C  0.543746 3.754899 -2.443984
C  1.753573 0.718792 0.406001
C  0.58311 4.116401 -3.944205
C  2.161999 -1.408086 1.643082
C  1.826937 -2.786181 1.727475
C  3.351077 -0.966413 2.280277
C  2.637542 -3.706014 2.415865
C  4.183662 -1.877159 2.966556
C  3.816937 -3.233567 3.024793
H  -2.631313 2.259973 -1.067404
H  -2.787553 1.654512 0.602463
H  -1.238387 -0.299999 -0.050037
H  -1.331985 0.261183 -1.743188
H  -0.510608 2.771128 2.109413
H  -0.673663 1.047744 1.664514
H  0.038827 4.269656 0.245464
H  -1.741998 4.302751 0.199209
H  -2.297169 -2.326697 -0.132971
H  -2.357894 -2.249134 -1.928656
H  -4.256426 0.997992 -1.862836
H  -3.526638 -0.211748 -2.979074
H  1.72224 2.816468 0.867716
H  -0.900143 5.282079 -1.856081
H  -1.628204 3.727511 -2.299268
H  -4.097692 -3.836136 -1.147352
H  -4.769684 -2.591189 -0.017443
H  -5.902916 -0.646765 -1.038388
H  -5.977389 -0.597036 -2.846759
H  0.670172 2.662919 -2.312656
H  1.397035 4.237854 -1.923319
H  2.852541 0.704341 0.297119
H  1.272594 0.807655 -0.58271
H  1.534875 3.802759 -4.410949
H  -0.240371 3.621005 -4.492843
H  0.476384 5.207464 -4.095104
H  1.414727 1.060701 3.124955
H  3.606903 0.096918 2.273689
H  2.357547 -4.761064 2.464994
H  5.095311 -1.525786 3.457444
