program: Gaussian 09
title: 000210526
version: EM64L-G09RevD.01
frameworkgroup: C1[X(C20H22N4O2)]
method: RPBEPBE
basis: SDD
operation: Freq
keyword: #p
keyword: freq=noraman
keyword: PBEPBE/SDD
title: #p freq=noraman PBEPBE/SDD
converged: YES YES NO NO
title: Mulliken charges:
elementType: O O N N N N C C C C C C C C C C C C C C C C C C C C H H H H H H H H H H H H H H H H H H H H H H
charge: -0.265940 -0.271596 -0.082523 -0.247111 -0.054556 0.021714 -0.364042 -0.372013 -0.392006 -0.385408 -0.399226 -0.361728 -0.274772 0.112883 -0.074327 0.192899 0.366773 0.173849 -0.360831 -0.354261 -0.067835 -0.362820 -0.246015 -0.242581 -0.311286 -0.243428 0.178296 0.206858 0.212654 0.170266 0.193488 0.206197 0.204667 0.193777 0.216040 0.190116 0.207584 0.213612 0.240081 0.228241 0.267720 0.244746 0.295971 0.269301 0.225485 0.223079 0.250572 0.227437
chargesum: 0.00000
title: Mulliken charges with hydrogens summed into heavy atoms:
elementType: O O N N N N C C C C C C C C C C C C C C C C C C C C
charge: -0.265940 -0.271596 -0.082523 -0.247111 -0.054556 0.021714 0.021112 0.010907 0.007680 0.013036 0.006930 0.059468 0.193549 0.112883 -0.074327 0.192899 0.366773 0.173849 -0.093111 -0.109515 0.228137 -0.093518 -0.020530 -0.019502 -0.060715 -0.015992
polarizability: 3.13098018e+02 -2.71812559e+01 3.79959280e+02 2.19069962e+01 2.66604225e+00 1.47962309e+02
1716.lowfreq: -5.5068 -0.0002 0.0004 0.0008 3.2128 4.4013 19.1701 23.0950 31.8960
frequency: 19.0633 23.0912 31.7309 38.0014 53.6680 65.7764 80.8787 97.3035 109.5081 125.0738 161.0336 169.8051 188.0190 209.9477 238.5914 260.0080 278.6027 280.0937 299.0660 327.2366 354.3217 376.9585 383.1702 400.2682 413.1429 439.5887 449.4726 462.2299 476.8794 511.4569 532.2503 558.4290 564.1818 586.9933 615.5588 646.4042 662.8165 671.6877 693.3206 708.8660 716.4666 755.1521 760.5667 777.2998 791.1859 805.9128 816.8136 827.2887 842.7115 851.1931 855.0802 875.7101 899.3331 908.3792 910.2179 922.1396 954.3759 957.6992 971.9786 989.6372 992.0849 995.2439 999.9954 1009.5121 1038.5330 1043.9930 1048.5829 1072.9835 1087.1156 1088.6148 1099.8206 1112.8853 1124.1098 1148.9524 1150.7514 1160.7879 1171.0801 1172.0621 1174.8773 1204.3031 1222.7261 1242.7410 1260.1164 1266.1200 1267.9310 1284.6360 1294.4881 1297.3880 1300.0639 1316.8862 1329.2607 1331.5457 1342.3922 1348.1392 1352.3895 1366.5772 1373.5845 1384.0648 1394.6618 1402.5681 1423.3219 1445.5644 1451.7570 1460.3440 1461.3986 1465.7678 1468.2718 1476.1066 1481.5243 1482.9114 1493.9230 1509.6655 1578.4095 1579.2121 1608.7697 1623.2527 2826.7889 2836.0989 2902.0133 2968.6143 2986.7931 2987.2345 3023.5390 3025.3338 3030.0413 3037.1135 3040.1697 3047.6801 3056.6299 3101.5688 3123.7307 3136.6105 3155.6692 3162.2794 3177.0611 3182.3086 3187.6708 3198.5238
redmass: 2.9624 4.8927 4.7461 6.2345 4.0330 3.8540 4.6331 3.6153 4.9645 2.5056 6.6897 6.0380 4.8308 3.3414 1.8552 5.6407 6.1039 4.9775 3.0163 2.9067 4.6727 4.1204 2.3742 2.7984 3.6595 3.7942 2.9884 4.4058 4.5749 3.8304 4.0534 3.8573 5.5347 4.0456 6.3689 7.2769 9.3324 7.5208 1.7505 4.2133 6.6022 3.4214 3.7037 3.2672 1.2422 1.3981 5.3159 1.3328 1.2640 1.8772 1.9332 8.0596 4.3669 2.9804 1.4377 1.4489 1.3360 1.3110 1.3974 4.8728 1.4065 2.5319 2.9343 4.6309 2.1833 1.9047 1.9860 7.0746 2.7379 1.8373 1.5378 2.0580 2.2322 3.3834 1.3942 2.1966 1.9211 1.1783 1.1738 1.1278 2.2399 1.6397 1.2412 1.1956 4.6210 1.2372 1.4251 2.4392 2.1664 1.4697 1.4640 1.2950 1.4217 1.4679 1.4744 1.5685 3.4484 2.8486 1.9787 1.9004 3.0468 2.9928 1.0910 1.0878 1.0887 1.0885 1.1139 1.1045 1.1201 2.4636 9.0188 5.0219 5.7861 5.8383 6.1087 10.9195 1.0716 1.0700 1.0693 1.0627 1.0621 1.0607 1.0687 1.0838 1.0845 1.0940 1.0888 1.1034 1.1037 1.1086 1.0851 1.0904 1.0973 1.0922 1.0887 1.0937 1.0956 1.1000
irintensity: 0.0988 0.0135 0.0462 0.6446 0.0601 0.6365 0.8385 1.8024 0.4452 0.6123 3.4472 4.8185 0.4360 4.0528 0.3893 0.0177 0.8709 0.2325 4.0213 1.5374 0.4886 1.8269 3.8945 0.9339 3.5875 4.9997 1.8726 20.1287 8.2652 15.5658 3.4767 8.1854 9.7423 4.0338 0.6784 4.3624 2.2288 7.4379 51.1002 1.2868 2.0083 12.3027 6.0173 38.8805 0.6678 0.0116 18.0124 50.3139 2.1541 4.0495 11.5412 13.0726 25.6625 27.0685 3.9273 4.8478 0.5067 3.5202 1.6750 0.8149 0.3580 16.9768 9.5613 86.7686 25.6087 31.5848 12.5331 1.2439 3.1952 11.7263 13.5467 25.0532 4.8052 132.2543 21.1021 46.0263 34.9906 7.8950 17.6932 7.7535 89.4868 7.0209 2.9134 3.0000 96.7323 13.6461 9.8903 80.8531 87.6337 16.3232 13.6291 0.9184 0.5322 3.1050 4.2797 11.5173 11.1806 81.3773 11.4983 30.7025 52.9187 18.2731 7.1740 15.0299 0.6408 7.0120 26.9950 9.7941 22.8707 21.4324 48.1550 201.1344 9.7482 15.6450 40.7893 354.3974 44.6155 145.7857 73.4685 39.1156 30.8181 33.9023 39.1874 46.5331 39.2937 42.5826 29.2514 18.5613 94.0041 26.5398 0.3894 20.0658 47.7070 3.4861 10.2038 12.0912 6.5517 7.0369
temp: 298.150 k
press: 1.00000 atm
elementType: 8 8 7 7 7 7 6 6 6 6 6 6 6 6 6 6 6 6 6 6 6 6 6 6 6 6 1 1 1 1 1 1 1 1 1 1 1 1 1 1 1 1 1 1 1 1 1 1
symmnumber: 1
zpe: 1018212.8 jmol-1
zpe.correction: 0.387817 hartree
zpe.thermalcorrener: 0.410251 hartree
zpe.thermalcorrenthalpy: 0.411195 hartree
zpe.thermalcorrgfe: 0.333487 hartree
zpe.sumelectzpe: -1142.877860 hartree
zpe.sumelectthermal: -1142.855426 hartree
zpe.sumelectthermalent: -1142.854482 hartree
zpe.sumelectthermalfe: -1142.932190 hartree
dipole: -3.0612 -0.1224 0.3204
dipole: 3.0804
quadrupole: -144.3364 -154.4078 -151.9033
quadrupole: -7.7505 2.7882 -1.6566
quadrupole: 5.8795 -4.1920 -1.6875 -7.7505 2.7882 -1.6566
hfenergy: -1143.2656771 hartree
pointgroup: C01 [X(C20H22N4O2)]
dipole: 1.1819572 0.2513659 0.0923443 debye
polarizability: 322.2830823|-35.1830694|368.2439608|-31.166136|10.18807|150.492564 unknown
InChI: InChI=1S/C20H22N4O2/c25-20-18(16-7-3-1-4-8-16)19(22-17-15-21-9-12-24(17)20)26-14-13-23-10-5-2-6-11-23/h1,3-4,7-9,12,15H,2,5-6,10-11,13-14H2
charge 0 multiplicity 1
48 atoms
O  0.5838 -0.374883 -0.090857
O  -4.179041 -1.155267 0.348355
N  4.131759 0.789534 -0.178881
N  -3.273423 1.008685 0.271487
N  -0.911596 1.410665 0.061132
N  -3.68271 3.806717 0.336791
C  4.543545 1.172726 1.197036
C  5.289203 0.311323 -0.978735
C  5.607077 2.289507 1.165834
C  6.374448 1.402333 -1.0802
C  6.830008 1.855019 0.32572
C  2.980485 -0.142461 -0.197483
C  1.669343 0.65017 -0.109733
C  -0.720451 0.056882 0.012944
C  -1.750124 -0.929824 0.082507
C  -3.118046 -0.47052 0.244249
C  -1.487139 -2.392989 0.007758
C  -2.165509 1.874736 0.180649
C  -2.281307 -3.311731 0.755063
C  -0.456879 -2.922527 -0.823429
C  -4.559935 1.530455 0.38922
C  -2.452703 3.289285 0.224435
C  -2.040313 -4.69949 0.686628
C  -0.229177 -4.311636 -0.900227
C  -4.742183 2.902376 0.416886
C  -1.015083 -5.210069 -0.142057
H  4.957165 0.285824 1.747484
H  3.653288 1.515515 1.755791
H  4.92731 0.042949 -1.988606
H  5.7418 -0.611912 -0.527954
H  5.911644 2.535312 2.201376
H  5.155945 3.19806 0.72241
H  5.956156 2.267662 -1.629887
H  7.231474 1.014294 -1.663718
H  7.561343 2.681548 0.249273
H  7.344843 1.01326 0.834174
H  3.017617 -0.894434 0.626212
H  2.98773 -0.705772 -1.148419
H  1.539435 1.311389 -0.982445
H  1.601565 1.262064 0.806324
H  -3.094071 -2.935534 1.380019
H  0.163235 -2.243481 -1.412711
H  -5.353001 0.782148 0.451903
H  -1.60109 3.972945 0.158922
H  -2.660523 -5.383156 1.277065
H  0.562703 -4.693127 -1.554823
H  -5.742324 3.331452 0.505555
H  -0.834397 -6.289419 -0.199837
