program: Gaussian 09
title: 000208206
version: EM64L-G09RevD.01
frameworkgroup: C1[X(C16H23N2O5PS)]
method: RPBEPBE
basis: SDD
operation: Freq
keyword: #p
keyword: freq=noraman
keyword: PBEPBE/SDD
title: #p freq=noraman PBEPBE/SDD
converged: YES YES NO NO
title: Mulliken charges:
elementType: S P O O O O O N N C C C C C C C C C C C C C C C C H H H H H H H H H H H H H H H H H H H H H H H
charge: 0.017325 1.086852 -0.201039 -0.200274 -0.682781 -0.658690 -0.594885 -0.315664 -0.218062 0.353034 -0.378806 -0.384579 -0.364292 -0.791906 -0.368293 -0.717178 -0.757595 0.082980 0.084674 0.179413 0.180909 -0.353765 -0.353945 -0.211316 -0.211416 0.221423 0.194679 0.243201 0.183565 0.221215 0.223337 0.219625 0.271058 0.341642 0.237624 0.240190 0.226134 0.200416 0.237597 0.246464 0.224133 0.228659 0.269702 0.269578 0.238841 0.238752 0.397398 0.404065
chargesum: 0.00000
title: Mulliken charges with hydrogens summed into heavy atoms:
elementType: S P O O O O O N N C C C C C C C C C C C C C C C C
charge: 0.017325 1.086852 -0.201039 -0.200274 -0.285383 -0.254625 -0.594885 -0.072463 -0.218062 0.353034 0.037295 0.020201 0.078670 -0.179206 0.109522 -0.053030 -0.058339 0.082980 0.084674 0.179413 0.180909 -0.084063 -0.084367 0.027525 0.027335
polarizability: 2.99139202e+02 -3.12745476e+01 2.32617531e+02 4.61500655e+00 1.44172854e+01 2.26372276e+02
1716.lowfreq: -8.3368 -3.8841 -0.0016 0.0012 0.0013 4.2762 9.7012 11.2950 15.8103
frequency: 9.3208 9.9556 15.7611 26.5145 33.2113 35.3613 51.5649 74.0554 92.4331 99.3105 118.9235 131.1159 137.3632 138.0973 159.5619 172.3246 177.1096 184.4371 191.3914 230.0788 235.7972 244.2267 260.2885 263.6008 266.5467 285.4638 299.1658 313.2589 324.1402 330.3590 348.3847 363.8539 365.8957 396.9894 416.3102 419.1311 438.3105 456.3713 482.7594 498.9149 523.0299 547.1961 588.8382 606.5822 648.3378 659.1665 676.5538 677.4957 699.8038 714.9584 716.7184 740.3978 752.2692 781.3864 785.9801 795.7489 846.4604 856.4234 885.6268 906.2962 924.5325 943.2284 946.7820 973.9607 978.0398 988.7455 1001.4608 1005.9465 1012.6354 1014.9879 1026.4815 1031.3176 1058.1532 1062.4753 1072.4709 1080.5048 1101.1938 1117.0117 1155.6934 1167.4252 1170.7807 1185.0991 1203.0368 1212.7864 1230.5204 1246.9387 1275.0290 1283.1613 1287.2715 1289.6819 1306.4134 1327.2116 1332.4619 1342.6535 1369.3706 1374.0781 1378.4925 1388.8777 1416.0931 1425.1428 1446.6462 1448.6052 1453.6117 1455.4588 1463.5167 1468.0183 1475.4634 1477.8933 1481.8788 1494.5042 1499.0466 1614.8194 1617.4981 1627.3025 1676.1225 2891.6459 2959.8662 2974.1211 2979.7978 2987.8046 3007.4123 3012.0830 3019.7944 3035.3476 3052.7854 3067.7424 3074.5105 3081.5228 3086.7245 3092.4632 3098.1059 3139.2437 3152.8301 3164.4493 3174.3918 3434.7784 3562.1805 3591.6439
redmass: 5.6236 7.8357 7.4752 4.4154 5.9401 5.8133 3.8868 4.7683 2.1558 2.8066 6.5048 3.6890 2.9589 4.9632 3.2153 4.6301 5.5957 3.2642 3.1577 4.3524 1.1405 2.3518 3.6105 3.1013 1.4794 1.4006 9.1478 3.8939 3.0767 5.7417 2.4792 2.4506 3.1807 2.7726 2.4695 3.2018 11.3202 4.8807 2.6780 3.3052 7.2117 5.6698 1.5167 8.2599 6.0707 4.7953 4.9559 9.6566 5.4120 11.8536 3.0599 1.1464 3.4871 1.5831 3.4393 1.6915 2.9966 1.6438 2.2136 1.3912 1.6268 1.4003 6.5499 1.4138 1.9333 1.8335 1.4556 1.3459 2.1281 1.3361 2.4448 2.9696 3.3678 2.1883 2.6605 2.6909 2.8819 1.5390 1.5832 1.2100 2.0072 2.1815 2.9061 1.6933 2.8599 1.3023 1.4912 1.5039 1.4068 1.0904 1.2725 1.4942 1.2763 3.0736 1.2763 1.5632 1.3714 1.2044 5.9883 1.0945 1.2897 1.2004 2.4635 1.9641 1.0533 1.0715 1.1081 1.0838 1.0684 1.0740 1.0768 7.7073 8.2448 11.0283 11.7269 1.0708 1.0637 1.0376 1.0360 1.0596 1.0573 1.0590 1.0898 1.0950 1.1020 1.0973 1.0990 1.1061 1.1068 1.1001 1.0996 1.0864 1.0906 1.0956 1.1004 1.0743 1.0657 1.0663
irintensity: 0.7928 0.0050 0.4684 0.6247 1.2933 1.0435 1.0225 2.0691 1.2178 0.5088 6.1248 32.9045 17.1115 0.0140 4.3061 6.6586 7.2870 6.9368 14.2549 0.4031 9.8786 28.2340 8.6047 3.4178 21.3374 4.4053 23.2840 2.8627 40.1838 19.1780 26.0089 75.4540 2.0976 1.7706 0.7173 1.9115 173.7258 0.0002 19.5476 13.7265 9.2183 2.2144 114.8354 14.3746 106.7336 0.0165 0.6523 141.0085 9.2675 167.5406 77.8790 7.4883 11.2584 0.2225 0.1015 29.5863 7.3275 4.1278 5.3973 0.0116 14.9910 0.6780 14.9758 2.2134 2.2347 55.8832 4.8767 0.0019 4.9763 124.3052 54.2811 10.3919 2.3964 86.6542 10.2775 5.0721 12.0543 24.9121 21.0469 8.9285 4.7769 72.0481 17.9197 11.1547 28.9782 9.0126 1.8908 0.4589 2.7680 1.3579 6.4253 67.9658 17.8327 257.8284 14.0463 42.9406 9.0466 36.2327 10.3476 4.3951 22.1069 13.4298 11.2822 5.8266 1.3392 1.2254 11.4068 4.2740 16.0953 8.4536 22.9130 3.1876 126.4216 315.6710 44.0362 55.8216 25.8118 29.6223 7.9525 12.8835 8.6689 29.8116 11.3284 5.1837 40.0013 22.5385 33.1368 16.5196 2.8533 3.3158 40.7940 1.7168 5.4469 6.0803 21.6634 1.9996 77.1988 48.3890
temp: 298.150 k
press: 1.00000 atm
elementType: 16 15 8 8 8 8 8 7 7 6 6 6 6 6 6 6 6 6 6 6 6 6 6 6 6 1 1 1 1 1 1 1 1 1 1 1 1 1 1 1 1 1 1 1 1 1 1 1
symmnumber: 1
zpe: 984267.7 jmol-1
zpe.correction: 0.374888 hartree
zpe.thermalcorrener: 0.403003 hartree
zpe.thermalcorrenthalpy: 0.403947 hartree
zpe.thermalcorrgfe: 0.310964 hartree
zpe.sumelectzpe: -1846.534383 hartree
zpe.sumelectthermal: -1846.506269 hartree
zpe.sumelectthermalent: -1846.505324 hartree
zpe.sumelectthermalfe: -1846.598307 hartree
dipole: -2.2553 0.0677 1.3893
dipole: 2.6497
quadrupole: -142.7699 -155.9130 -171.4552
quadrupole: -18.5868 12.1889 6.2602
quadrupole: 13.9428 0.7997 -14.7425 -18.5868 12.1889 6.2602
hfenergy: -1846.9092712 hartree
pointgroup: C01 [X(C16H23N2O5P1S1)]
dipole: 0.8809104 0.2092811 0.5166898 debye
polarizability: 300.8575425|-28.3312162|219.8339982|8.0638016|-12.2459841|237.4374673 unknown
InChI: InChI=1S/C16H23N2O5PS/c1-16(2,11-25-24(21,22)23)17-9-5-6-10-18-14(19)12-7-3-4-8-13(12)15(18)20/h3-4,7-8,17,21-22H,5-6,9-11H2,1-2H3
charge 0 multiplicity 1
48 atoms
S  -6.508977 -0.505511 -0.891714
P  -5.906467 -2.001115 0.692758
O  3.560097 0.151436 -2.444397
O  3.34796 1.318294 2.113134
O  -6.61933 -1.592462 2.231116
O  -6.993391 -3.282446 0.343401
O  -4.340353 -2.282512 0.775429
N  -3.031899 1.941427 -0.788952
N  3.177219 0.931683 -0.22885
C  -4.430417 1.537493 -0.461009
C  -1.889376 1.080173 -0.407447
C  -0.562632 1.835827 -0.629135
C  0.669374 0.968139 -0.293395
C  -4.753514 0.205046 -1.203071
C  1.98622 1.751203 -0.497584
C  -5.355742 2.669425 -0.962482
C  -4.585997 1.375348 1.070961
C  3.865913 0.180193 -1.226058
C  3.759157 0.7662 1.062003
C  4.980835 -0.517222 -0.50613
C  4.917212 -0.166236 0.86483
C  5.96928 -1.383648 -0.995089
C  5.840455 -0.670492 1.79251
C  6.90827 -1.900461 -0.064091
C  6.844771 -1.549361 1.308196
H  -1.984647 0.82502 0.663581
H  -1.847532 0.112771 -0.962718
H  -2.954104 2.279059 -1.758465
H  -0.500811 2.165006 -1.688664
H  -0.572091 2.754204 -0.010702
H  0.612485 0.622787 0.756885
H  0.681712 0.066741 -0.93642
H  -4.722388 0.344282 -2.298784
H  -4.052242 -0.598952 -0.915762
H  2.061216 2.104239 -1.54216
H  2.020089 2.623689 0.179784
H  -6.416722 2.409027 -0.799686
H  -5.210563 2.850201 -2.045803
H  -5.130419 3.606034 -0.424314
H  -4.178036 2.26958 1.572102
H  -5.655257 1.282954 1.333793
H  -4.047712 0.485202 1.44645
H  6.008339 -1.647304 -2.056599
H  5.781923 -0.392294 2.849415
H  7.694286 -2.581082 -0.408342
H  7.582718 -1.96412 2.003195
H  -6.076492 -0.981058 2.791503
H  -7.314825 -3.762202 1.151777
