program: Gaussian 09
title: 000210549
version: EM64L-G09RevD.01
frameworkgroup: C1[X(C16H20N4O2)]
method: RPBEPBE
basis: SDD
operation: Freq
keyword: #p
keyword: freq=noraman
keyword: PBEPBE/SDD
title: #p freq=noraman PBEPBE/SDD
converged: YES YES NO NO
title: Mulliken charges:
elementType: O O N N N N C C C C C C C C C C C C C C C C H H H H H H H H H H H H H H H H H H H H
charge: -0.267547 -0.266252 -0.105134 -0.110130 -0.097753 -0.067460 -0.359076 -0.512270 -0.383852 0.510450 -0.625343 -0.467543 -0.452527 0.209912 0.158657 -0.329103 -0.644613 0.107167 -0.205781 -0.284983 -0.279972 -0.197809 0.184640 0.275466 0.201071 0.220124 0.266953 0.205344 0.190709 0.219742 0.227371 0.281441 0.235676 0.247481 0.218742 0.290427 0.224100 0.228708 0.237765 0.239844 0.243679 0.231679
chargesum: 0.00000
title: Mulliken charges with hydrogens summed into heavy atoms:
elementType: O O N N N N C C C C C C C C C C C C C C C C
charge: -0.267547 -0.266252 -0.105134 -0.110130 -0.097753 -0.067460 0.101030 -0.091075 0.088445 0.510450 0.012479 -0.186102 -0.216852 0.209912 0.158657 -0.081622 0.088656 0.107167 0.260693 -0.045139 -0.036293 0.033870
polarizability: 2.02404845e+02 -3.17455443e+01 2.51551339e+02 -3.48242868e+00 -2.92158517e+00 1.58071245e+02
1716.lowfreq: -6.2397 0.0005 0.0007 0.0008 1.3578 7.7338 8.5707 15.2374 24.0211
frequency: 7.6136 14.9557 23.9971 41.9785 58.4856 78.3454 90.0376 113.2002 119.3803 126.5418 140.8815 180.8377 196.8058 206.7291 226.4279 255.9320 279.0697 296.3847 323.6062 341.3012 366.1893 393.6540 407.8211 411.7427 421.9200 468.3699 515.5291 521.8340 532.7198 573.4324 598.4875 607.2180 627.5088 675.7949 716.9207 752.0147 754.4716 774.7678 778.2384 781.2419 794.4068 808.1241 835.6462 848.8277 896.7169 917.4721 930.2573 934.4744 954.2947 964.3664 972.9530 979.2933 982.7607 1020.5050 1038.9259 1053.1002 1054.6520 1057.0389 1072.8168 1075.2610 1106.3997 1115.9618 1122.7813 1127.9488 1132.1116 1168.1840 1172.3924 1192.7801 1210.3444 1239.8151 1245.8267 1249.2513 1271.2432 1279.5432 1298.9514 1308.9608 1332.6444 1348.6271 1363.1739 1378.6777 1379.4602 1405.1505 1405.5118 1410.3932 1431.7513 1439.5763 1443.5373 1464.1364 1467.4452 1468.3915 1474.9633 1476.5107 1483.2034 1485.2658 1490.0776 1506.2228 1533.0716 1573.4946 1612.2725 1630.6367 2848.7497 2853.3999 2867.0382 2961.7598 2983.9073 2990.7733 3011.3800 3023.6629 3032.7816 3058.7217 3080.1223 3095.0628 3105.7325 3122.3838 3125.1563 3127.3043 3132.6783 3176.0610 3179.1152 3187.0083
redmass: 5.1796 5.6892 5.0417 4.7992 4.8795 3.0644 2.5037 2.6042 2.5553 1.3521 4.3805 3.9392 3.3073 1.1693 5.5148 3.0554 3.1775 3.8685 3.9524 2.9029 2.7331 3.2075 3.8731 3.8346 3.0669 3.5427 3.8554 3.0544 5.0465 4.8368 4.8212 5.1657 7.7638 8.9916 4.8004 5.1355 5.3710 1.5929 3.8108 1.5621 2.6307 1.4483 7.5493 4.1295 1.4238 3.3930 1.3559 8.0898 1.3738 1.4502 4.1296 2.7319 2.3607 2.2829 1.6787 2.8431 3.4229 2.6261 1.5026 1.7000 1.3924 1.6917 1.3004 1.1651 1.3957 1.8520 1.6953 2.4712 2.0027 1.4522 3.8412 3.7428 1.5039 2.1529 1.5606 1.4516 1.2856 1.6573 1.2716 1.6464 1.3998 1.9097 2.6125 1.2418 1.1832 4.2419 1.1915 1.1596 1.2168 1.2049 1.0948 1.3967 1.0977 1.3209 1.0539 5.5776 2.9440 5.0396 7.9870 8.2625 1.0675 1.0655 1.0654 1.0368 1.0864 1.0621 1.0638 1.0720 1.1013 1.0870 1.1001 1.1016 1.1087 1.0964 1.0910 1.0919 1.0897 1.0932 1.0950 1.0982
irintensity: 0.0104 0.0129 0.1265 0.3535 0.5402 1.6541 13.0133 3.9897 1.0836 0.6657 5.6130 0.5868 2.0004 0.2325 0.1382 1.6135 1.5134 2.6948 1.2506 4.9901 6.3792 14.5669 0.9463 0.9911 11.1897 3.3037 12.2885 0.9773 3.1928 11.1592 0.7348 1.9826 2.4189 0.5741 1.1323 5.2777 5.7076 3.4861 21.9032 21.8462 49.2941 46.3780 24.2471 16.6892 22.8719 6.3770 3.1631 4.1325 0.1336 0.3401 111.3253 57.0663 52.5508 42.1333 27.4388 7.4553 18.1447 4.2189 6.8037 0.3333 10.1808 17.6702 0.0626 3.4444 4.2700 35.8444 9.2387 7.1501 17.7171 11.4501 117.8716 65.1299 10.7713 0.1842 20.8904 20.6525 4.1011 25.3803 2.3520 94.1325 3.8779 1.0865 13.5442 41.3338 14.4134 38.4271 52.2048 33.0384 11.2974 75.3744 21.0186 25.2783 6.8591 25.5610 16.1299 82.5669 66.4029 516.5670 4.1731 0.2673 47.7033 54.6218 234.5928 87.7257 29.7659 138.0458 36.7788 56.9597 39.1285 8.4209 38.8477 14.2240 30.9345 1.0911 27.8497 21.2172 10.6151 2.8006 5.2217 15.9044
temp: 298.150 k
press: 1.00000 atm
elementType: 8 8 7 7 7 7 6 6 6 6 6 6 6 6 6 6 6 6 6 6 6 6 1 1 1 1 1 1 1 1 1 1 1 1 1 1 1 1 1 1 1 1
symmnumber: 1
zpe: 892436.7 jmol-1
zpe.correction: 0.339911 hartree
zpe.thermalcorrener: 0.360819 hartree
zpe.thermalcorrenthalpy: 0.361763 hartree
zpe.thermalcorrgfe: 0.286089 hartree
zpe.sumelectzpe: -989.469058 hartree
zpe.sumelectthermal: -989.448150 hartree
zpe.sumelectthermalent: -989.447206 hartree
zpe.sumelectthermalfe: -989.522880 hartree
dipole: -0.0338 1.1656 0.4345
dipole: 1.2444
quadrupole: -127.8671 -111.2718 -129.4579
quadrupole: -5.9289 -2.0580 1.6719
quadrupole: -5.0015 11.5938 -6.5923 -5.9289 -2.0580 1.6719
hfenergy: -989.808969 hartree
pointgroup: C01 [X(C16H20N4O2)]
dipole: -0.0285071 -0.4582859 0.1698493 debye
polarizability: 197.7467043|-28.3086835|255.5530186|6.3159551|0.7301577|158.7277061 unknown
InChI: InChI=1S/C16H20N4O2/c1-19(8-9-20(2)16-17-6-3-7-18-16)11-13-4-5-14-15(10-13)22-12-21-14/h3-7,10H,8-9,11-12H2,1-2H3
charge 0 multiplicity 1
42 atoms
O  -2.968485 1.318815 -1.957353
O  -4.044301 2.233301 -0.019372
N  -0.060473 -2.832554 -0.241225
N  3.15442 -0.778337 -0.221844
N  4.191664 1.187394 0.602035
N  1.851682 1.18315 -0.149563
C  1.004023 -1.964298 0.313883
C  -1.324295 -2.780048 0.534911
C  1.989096 -1.490741 -0.784961
C  -2.029917 -1.429976 0.447652
C  0.386163 -4.220184 -0.477597
C  -2.0903 -0.749675 -0.804714
C  -2.661959 -0.878963 1.588764
C  -2.800761 0.44785 -0.845745
C  -3.437015 0.986925 0.294224
C  -3.381975 0.347949 1.533435
C  4.379354 -1.549897 0.032802
C  3.068206 0.563384 0.086853
C  -3.943651 2.340519 -1.499011
C  4.069254 2.511196 0.880788
C  1.784796 2.507993 0.138927
C  2.875956 3.240612 0.664206
H  1.570829 -2.478215 1.13156
H  0.536709 -1.062809 0.745681
H  -1.171618 -3.04222 1.612879
H  -1.987322 -3.564617 0.116192
H  1.445659 -0.821888 -1.47084
H  2.375878 -2.350797 -1.362122
H  0.649889 -4.76493 0.464574
H  1.275568 -4.230613 -1.131033
H  -0.411845 -4.787085 -0.989979
H  -1.573048 -1.159468 -1.675798
H  -2.596173 -1.409849 2.545496
H  -3.86193 0.774765 2.417706
H  4.161978 -2.419961 0.682254
H  5.109909 -0.895084 0.528958
H  4.811843 -1.920922 -0.917049
H  -4.933507 2.121094 -1.944077
H  -3.566402 3.340895 -1.760756
H  4.963922 2.994649 1.291125
H  0.817287 2.986153 -0.05501
H  2.799591 4.305287 0.894442
