program: Gaussian 09
title: 000210530
version: EM64L-G09RevD.01
frameworkgroup: C1[X(C19H19N3O4)]
method: RPBEPBE
basis: SDD
operation: Freq
keyword: #p
keyword: freq=noraman
keyword: PBEPBE/SDD
title: #p freq=noraman PBEPBE/SDD
converged: YES YES NO NO
title: Mulliken charges:
elementType: O O O O N N N C C C C C C C C C C C C C C C C C C C H H H H H H H H H H H H H H H H H H H
charge: -0.267190 -0.268084 -0.264735 -0.230862 -0.247647 -0.067321 0.021840 -0.084540 -0.403972 -0.077471 0.149031 0.186255 0.357932 0.179230 0.242348 -0.700920 -0.066446 -0.366361 -0.361848 -0.366890 -0.244517 -0.244268 -0.311442 -0.261453 -0.243344 -0.662908 0.279057 0.227049 0.221027 0.259368 0.216831 0.215960 0.295489 0.262620 0.268197 0.268227 0.225270 0.226504 0.250661 0.238232 0.226815 0.226777 0.221832 0.227578 0.248088
chargesum: 0.00000
title: Mulliken charges with hydrogens summed into heavy atoms:
elementType: O O O O N N N C C C C C C C C C C C C C C C C C C C
charge: -0.267190 -0.268084 -0.264735 -0.230862 -0.247647 -0.067321 0.021840 0.194518 0.044104 -0.077471 0.149031 0.186255 0.357932 0.179230 0.242348 -0.008760 0.229043 -0.103741 -0.093651 -0.098663 -0.019248 -0.017764 -0.060780 0.203594 -0.016567 0.034591
polarizability: 2.90582331e+02 -1.86216861e+01 3.70389123e+02 -8.89812872e+00 -8.35782266e+00 1.41741994e+02
1716.lowfreq: -1.9942 -1.1036 -0.0007 -0.0006 0.0005 5.8817 13.2427 28.8822 37.7965
frequency: 13.0600 28.8544 37.7877 44.3990 53.8493 61.0641 69.3974 77.5142 90.3082 98.4556 105.6809 148.4207 169.5959 177.8115 182.6718 201.2571 234.8740 243.5931 255.6758 275.1141 288.4716 303.2820 327.0673 344.0965 380.4953 390.4726 402.3775 431.8783 443.8777 481.3360 495.1104 515.1947 546.1695 564.2118 582.9204 614.6789 615.7767 647.2682 660.6094 669.9878 696.6559 706.5935 710.0978 728.6069 755.0072 772.0521 777.2897 806.9076 814.6067 823.1310 827.6264 849.2973 852.4895 875.8836 909.4347 915.1357 925.5350 927.5978 954.4624 976.7593 988.6915 994.0418 999.8208 1009.8057 1012.8430 1038.7166 1060.0555 1072.4116 1087.0939 1093.1948 1098.3367 1105.3970 1143.8352 1156.1637 1156.9779 1171.7525 1175.0450 1203.0955 1222.2805 1245.0030 1265.3057 1272.1685 1276.8647 1298.6593 1309.3664 1322.6336 1330.5947 1349.6820 1358.6674 1372.7650 1384.3881 1390.7075 1396.8597 1398.6620 1426.2907 1444.8177 1454.5281 1460.4991 1463.5924 1474.6139 1483.3697 1484.1028 1489.6412 1498.4017 1512.6474 1579.4619 1579.7206 1609.0661 1627.8907 1646.8944 2986.9030 2993.3204 3007.0582 3032.9417 3050.9029 3060.3039 3080.4400 3088.6978 3094.6107 3099.5383 3121.5984 3123.4633 3136.2043 3153.0932 3161.4386 3166.1032 3176.8865 3179.7675 3198.2390
redmass: 4.5594 5.4476 5.4612 5.5888 4.0169 3.2490 3.9022 3.4609 4.2603 3.7704 4.5881 5.8637 5.1493 1.8285 2.5509 1.6919 3.1844 1.6747 6.4807 5.2283 4.0739 2.8870 4.9705 8.6548 5.3201 4.2537 2.8677 5.3191 3.8198 4.6167 6.1301 4.0345 6.6730 5.7551 7.3146 6.2777 5.8977 7.2199 9.9462 6.5984 1.8505 5.0386 3.9163 4.2690 3.3408 1.7954 2.8254 1.5009 2.6702 3.2552 1.3511 1.2723 3.7103 7.4336 1.4402 2.5039 1.6547 2.2815 1.3370 1.3896 5.3115 1.3804 2.7110 3.8953 3.1402 2.2204 1.5556 7.2235 1.7845 2.3027 2.5722 2.6770 3.4247 2.6135 1.6646 1.7123 1.2698 1.1291 2.2919 1.5757 1.1704 4.7413 1.1194 2.5895 2.1227 1.4119 1.4742 1.3261 1.3869 4.0257 5.0332 1.2315 1.3398 1.7637 3.3306 3.1819 1.0874 1.0876 1.0496 1.0426 1.1362 2.1364 1.0561 11.3778 5.9173 5.8877 5.8207 5.9733 11.3410 9.9713 1.0368 1.0360 1.0608 1.0598 1.0836 1.1001 1.1000 1.0974 1.1027 1.1005 1.1067 1.0850 1.0897 1.0952 1.0921 1.0973 1.0886 1.0964 1.1001
irintensity: 0.1505 0.7675 0.5754 0.9844 0.1594 1.0038 0.1761 0.7121 0.9724 0.7089 0.3514 4.7044 1.3483 2.4349 2.0888 1.5828 1.4388 1.3639 0.6181 0.9607 0.0531 5.2048 16.6249 3.5666 1.6034 4.1674 0.5813 2.3698 4.6644 3.8281 10.5035 18.5532 7.6661 8.2138 7.9744 0.9430 12.6738 3.6422 0.5896 5.0249 49.9084 4.0748 1.3630 9.0318 5.2174 1.0871 45.9709 8.1380 3.3585 11.0193 48.8473 2.9689 2.2693 11.3893 3.3173 14.4361 9.6329 39.7267 0.4939 1.6680 1.1426 0.7817 5.7203 28.1097 121.3130 38.9837 0.7580 3.0477 2.8148 150.2949 30.8138 174.8198 278.6483 77.0288 13.4070 18.4442 14.0735 5.6463 54.4494 11.3137 6.9486 52.1660 3.3817 65.9605 49.2194 17.2086 17.1542 4.1900 1.8947 20.6110 97.3993 17.7777 17.9634 22.8775 36.9756 8.9347 5.8637 16.9848 13.1803 5.8125 8.7477 31.7292 12.4930 96.7051 183.1621 12.5578 8.5268 28.6305 349.5280 169.6395 24.3969 17.7504 18.0614 24.9554 9.3315 7.1322 51.1789 30.7352 1.7350 31.4948 31.2951 0.3054 17.5858 36.5466 3.6346 17.7278 9.8039 10.6596 6.9189
temp: 298.150 k
press: 1.00000 atm
elementType: 8 8 8 8 7 7 7 6 6 6 6 6 6 6 6 6 6 6 6 6 6 6 6 6 6 6 1 1 1 1 1 1 1 1 1 1 1 1 1 1 1 1 1 1 1
symmnumber: 1
zpe: 913879.8 jmol-1
zpe.correction: 0.348078 hartree
zpe.thermalcorrener: 0.371996 hartree
zpe.thermalcorrenthalpy: 0.372941 hartree
zpe.thermalcorrgfe: 0.291897 hartree
zpe.sumelectzpe: -1198.699967 hartree
zpe.sumelectthermal: -1198.676049 hartree
zpe.sumelectthermalent: -1198.675105 hartree
zpe.sumelectthermalfe: -1198.756149 hartree
dipole: -3.7271 -1.2159 1.1329
dipole: 4.0809
quadrupole: -131.9983 -148.4524 -152.6013
quadrupole: -1.3276 4.2497 3.7572
quadrupole: 12.3523 -4.1017 -8.2506 -1.3276 4.2497 3.7572
hfenergy: -1199.0480459 hartree
pointgroup: C01 [X(C19H19N3O4)]
dipole: -1.4603452 0.4413995 -0.5003289 debye
polarizability: 289.9088907|18.8647263|369.0754107|10.9182875|-20.4513508|143.7291468 unknown
InChI: InChI=1S/C19H19N3O4/c1-3-14(19(24)25-4-2)26-17-16(13-8-6-5-7-9-13)18(23)22-11-10-20-12-15(22)21-17/h5-12,14H,3-4H2,1-2H3
charge 0 multiplicity 1
45 atoms
O  -0.899146 -0.674543 -1.023547
O  -3.904701 1.337885 -0.45072
O  3.67834 -0.187572 0.446555
O  -2.460209 0.305852 1.069986
N  2.360755 1.670831 -0.138111
N  0.072031 1.450547 -0.843484
N  2.129316 4.470939 -0.463891
C  -2.158225 0.008707 -1.384567
C  -3.031711 -1.034881 -2.110823
C  1.337357 -0.574284 -0.167715
C  0.186869 0.102402 -0.657548
C  2.535746 0.206993 0.07061
C  1.353077 -2.033297 0.117542
C  1.136765 2.221309 -0.570299
C  -2.817203 0.543767 -0.102972
C  -3.383408 -2.270133 -1.25653
C  3.446966 2.503121 0.122631
C  2.503716 -2.821358 -0.167057
C  0.227433 -2.666456 0.720298
C  1.095243 3.657275 -0.712907
C  2.5175 -4.203197 0.117493
C  0.252183 -4.044564 1.016101
C  3.315625 3.871593 -0.039831
C  -4.702569 1.91558 0.680207
C  1.393486 -4.823046 0.709972
C  -5.764067 0.921268 1.156159
H  -1.941584 0.868141 -2.042503
H  -2.48108 -1.347883 -3.01727
H  -3.94984 -0.516068 -2.443344
H  -2.468697 -2.78789 -0.921692
H  -3.987527 -2.982463 -1.846025
H  -3.968895 -1.993051 -0.360111
H  4.351357 1.985703 0.450324
H  3.387337 -2.346782 -0.600905
H  -0.656035 -2.071309 0.970259
H  0.151539 4.098081 -1.047541
H  3.410389 -4.793712 -0.116468
H  -0.618038 -4.510294 1.492494
H  4.153969 4.541372 0.162118
H  -4.005854 2.184006 1.493449
H  -5.147103 2.822987 0.242055
H  1.408715 -5.895075 0.937333
H  -6.396242 1.395925 1.929266
H  -6.416219 0.609792 0.321975
H  -5.294659 0.02708 1.599536
