program: Gaussian 09
title: 000210524
version: EM64L-G09RevD.01
frameworkgroup: C1[X(C19H20N4O2)]
method: RPBEPBE
basis: SDD
operation: Freq
keyword: #p
keyword: freq=noraman
keyword: PBEPBE/SDD
title: #p freq=noraman PBEPBE/SDD
converged: YES YES NO NO
title: Mulliken charges:
elementType: O O N N N N C C C C C C C C C C C C C C C C C C C H H H H H H H H H H H H H H H H H H H H
charge: -0.276574 -0.269889 -0.078959 -0.246676 -0.052394 0.022173 -0.439277 -0.433423 -0.446278 -0.444040 -0.346553 -0.254824 0.125964 -0.082432 0.191254 0.367426 0.173668 -0.360820 -0.368166 -0.067152 -0.362739 -0.244488 -0.240100 -0.310965 -0.244239 0.217946 0.222582 0.272686 0.218885 0.218310 0.223735 0.222906 0.219687 0.198234 0.203079 0.217301 0.245678 0.266971 0.249289 0.295887 0.268993 0.226121 0.221929 0.250862 0.228423
chargesum: 0.00000
title: Mulliken charges with hydrogens summed into heavy atoms:
elementType: O O N N N N C C C C C C C C C C C C C C C C C C C
charge: -0.276574 -0.269889 -0.078959 -0.246676 -0.052394 0.022173 0.001250 0.058148 -0.004234 -0.001447 0.054761 0.208155 0.125964 -0.082432 0.191254 0.367426 0.173668 -0.093850 -0.118877 0.228736 -0.093746 -0.018367 -0.018171 -0.060103 -0.015816
polarizability: 3.60824409e+02 5.60120213e+01 2.94641261e+02 2.57635711e+01 -1.59491341e+01 1.39987178e+02
1716.lowfreq: -2.1673 -0.0008 -0.0002 0.0004 5.9624 6.8570 22.0451 33.2820 36.1856
frequency: 21.8685 33.0647 35.9849 40.1263 56.7007 66.8462 81.6993 88.0863 101.4526 124.7763 152.3103 166.1073 190.0730 224.5590 258.6121 279.2188 280.8158 302.4508 313.5332 369.5034 380.9224 389.2948 400.9525 436.6094 441.6242 495.0482 511.1271 533.3398 564.2565 578.3902 615.5517 630.0025 635.2787 646.4554 662.9009 669.8316 693.5326 708.0793 714.7655 723.1031 756.3346 776.5537 803.8732 820.3798 827.1518 830.7782 842.3273 844.8045 875.6463 878.1402 906.4280 909.5749 922.3459 930.7134 953.6262 954.2308 972.5909 980.5087 989.6231 993.1559 999.9799 1009.2544 1027.6461 1038.2809 1059.4037 1064.5283 1072.8320 1088.1514 1100.0653 1117.8051 1148.8410 1171.1134 1171.9873 1174.6547 1195.4311 1203.0440 1211.8176 1215.7916 1222.7614 1245.8749 1267.7805 1281.0211 1290.6709 1297.2872 1299.4128 1304.9522 1317.8379 1325.1043 1328.0464 1337.9130 1372.4115 1374.3542 1388.9753 1399.3755 1422.4368 1441.9067 1447.9965 1454.4168 1466.0815 1472.1700 1476.6125 1482.8673 1489.9164 1494.4915 1509.7002 1578.7057 1579.4877 1608.7993 1624.2595 2885.4697 2987.9680 2998.6030 2999.9854 3013.0456 3016.1938 3030.1978 3052.5718 3068.2577 3082.9052 3096.9127 3115.1574 3123.5371 3135.9870 3155.5236 3162.5948 3175.6253 3176.5944 3185.1432 3198.0130
redmass: 4.5572 4.3383 3.4342 6.2363 3.6974 2.4188 3.0818 3.5237 5.2398 5.3637 2.7948 7.3167 6.3590 3.3014 6.3960 5.3705 4.3700 2.2032 5.4451 4.9882 5.1677 2.2300 2.9231 4.0679 3.6620 4.2715 3.9290 7.3928 5.5973 7.1738 6.3721 2.7872 2.6465 5.7930 8.8750 7.6139 1.7925 3.5699 2.7299 3.7036 3.4848 3.4171 4.1734 1.8074 1.3350 1.8510 2.3336 1.5794 7.4694 3.6815 2.6393 1.4416 1.4432 1.8918 1.8669 1.3371 1.3979 2.7291 4.8489 1.3941 2.8067 4.8007 2.5652 2.1931 1.9898 2.1023 7.2377 1.7774 2.1939 2.8853 3.8220 1.7975 1.3323 1.1721 1.1756 1.1275 1.1442 1.1624 2.1501 1.4013 4.7186 1.3569 1.1975 2.6105 1.2481 2.1081 1.2290 1.6026 1.4717 1.3963 1.8562 2.6495 3.7542 1.9982 3.2013 2.0166 1.0848 1.3960 1.0853 1.0821 1.0967 2.6115 1.1062 9.0667 5.0701 5.7859 5.8638 6.0901 11.0144 1.0696 1.0641 1.0691 1.0596 1.0653 1.0639 1.0812 1.1013 1.1014 1.1047 1.1070 1.0981 1.0851 1.0901 1.0967 1.0921 1.0948 1.0887 1.0957 1.1000
irintensity: 0.0690 0.0324 0.3764 0.7997 0.0488 0.1490 1.0603 1.4611 0.8362 0.1519 3.8313 4.3251 3.2730 0.8315 0.2572 0.2393 0.6935 2.0857 0.6190 4.5066 1.3132 8.2927 0.1162 0.3811 4.8837 15.0431 16.6441 5.7786 9.7306 9.4570 0.6881 7.4116 10.8461 1.6875 3.1434 4.4718 52.1155 4.5125 10.0487 1.7793 9.1028 39.3068 22.1870 2.6457 49.3251 1.9472 0.9117 3.4710 11.2980 25.2670 1.3899 4.1756 3.6005 26.5898 7.1361 0.4859 0.9954 19.4010 1.9034 1.0965 10.8113 76.1789 2.6891 32.2912 7.8227 22.2324 0.4433 13.2362 12.9547 5.6429 138.2668 33.9292 3.4369 13.8531 3.2418 7.1096 5.2256 1.9397 77.3267 9.9357 105.2211 8.4108 13.3563 60.3091 1.7662 95.3602 0.9478 8.8310 14.7186 44.2696 3.5284 7.5393 69.6445 47.0878 47.5717 18.2179 13.4454 15.7468 1.0828 10.6061 5.6489 32.3898 15.0813 63.5834 196.3114 7.8621 16.5511 33.6517 344.0290 65.9401 50.1248 41.7554 42.1725 7.4948 38.0828 41.3092 13.7981 15.6659 87.3038 17.1711 9.4992 1.2903 18.3791 42.4645 3.3059 13.6878 10.0154 6.4658 7.0235
temp: 298.150 k
press: 1.00000 atm
elementType: 8 8 7 7 7 7 6 6 6 6 6 6 6 6 6 6 6 6 6 6 6 6 6 6 6 1 1 1 1 1 1 1 1 1 1 1 1 1 1 1 1 1 1 1 1
symmnumber: 1
zpe: 943388.2 jmol-1
zpe.correction: 0.359318 hartree
zpe.thermalcorrener: 0.380703 hartree
zpe.thermalcorrenthalpy: 0.381647 hartree
zpe.thermalcorrgfe: 0.306557 hartree
zpe.sumelectzpe: -1103.647297 hartree
zpe.sumelectthermal: -1103.625912 hartree
zpe.sumelectthermalent: -1103.624968 hartree
zpe.sumelectthermalfe: -1103.700058 hartree
dipole: 2.0392 -1.2727 0.8382
dipole: 2.5457
quadrupole: -134.7134 -149.8398 -145.4857
quadrupole: -0.9697 5.2446 -6.2208
quadrupole: 8.6329 -6.4935 -2.1394 -0.9697 5.2446 -6.2208
hfenergy: -1104.0066146 hartree
pointgroup: C01 [X(C19H20N4O2)]
dipole: -0.8259273 -0.2437114 -0.5114441 debye
polarizability: 336.5946494|-75.1634632|293.3251615|26.4677508|51.3718414|165.5330371 unknown
InChI: InChI=1S/C19H20N4O2/c24-19-17(15-6-2-1-3-7-15)18(21-16-14-20-8-11-23(16)19)25-13-12-22-9-4-5-10-22/h1-3,6-8,11,14H,4-5,9-10,12-13H2
charge 0 multiplicity 1
45 atoms
O  -0.903701 -0.598429 -0.5720
O  3.139486 1.346904 1.251786
N  -3.829216 -1.584658 -0.062093
N  3.099213 -0.822186 0.352481
N  1.098356 -1.803253 -0.555104
N  4.475913 -3.21672 -0.253952
C  -5.294582 -1.753427 -0.29581
C  -3.766871 -0.33039 0.754794
C  -5.880402 -0.320082 -0.541953
C  -4.867611 0.629582 0.180359
C  -3.030956 -1.539354 -1.314724
C  -1.548416 -1.843688 -1.095701
C  0.440674 -0.637392 -0.272189
C  1.026056 0.521649 0.320377
C  2.426671 0.460243 0.694174
C  0.265414 1.772838 0.586738
C  2.404087 -1.887601 -0.253884
C  0.534988 2.549196 1.751231
C  -0.733308 2.242744 -0.315227
C  4.454465 -0.950106 0.648559
C  3.173032 -3.078308 -0.53058
C  -0.181937 3.735388 2.011695
C  -1.437974 3.436831 -0.058333
C  5.113461 -2.128288 0.342201
C  -1.171463 4.188617 1.109574
H  -5.739902 -2.184097 0.621729
H  -5.484656 -2.457062 -1.124688
H  -2.756262 0.101979 0.729988
H  -4.007025 -0.594224 1.802212
H  -6.904276 -0.225414 -0.139107
H  -5.928663 -0.096599 -1.623097
H  -4.425508 1.35262 -0.528518
H  -5.346496 1.213658 0.985636
H  -3.120164 -0.576817 -1.875269
H  -3.415435 -2.336553 -1.979864
H  -1.042866 -2.118086 -2.039056
H  -1.418272 -2.654001 -0.359009
H  1.314026 2.225596 2.445163
H  -0.952083 1.672956 -1.221541
H  4.905115 -0.072638 1.117501
H  2.645162 -3.915399 -0.996953
H  0.038718 4.309958 2.918207
H  -2.193266 3.782757 -0.773336
H  6.175943 -2.248269 0.563468
H  -1.722272 5.114523 1.310013
