program: Gaussian 09
title: 000208202
version: EM64L-G09RevD.01
frameworkgroup: C1[X(C11H9Cl2NS)]
method: RPBEPBE
basis: SDD
operation: Freq
keyword: #p
keyword: freq=noraman
keyword: PBEPBE/SDD
title: #p freq=noraman PBEPBE/SDD
converged: YES YES NO NO
title: Mulliken charges:
elementType: Cl Cl S N C C C C C C C C C C C H H H H H H H H H
charge: -0.057773 -0.053168 0.238599 -0.019490 -0.307773 0.234300 -0.421711 0.361384 -0.601318 -0.351937 -0.369938 -0.465407 -0.220178 -0.232247 -0.107500 0.251133 0.263455 0.278938 0.269607 0.268411 0.253653 0.273093 0.257852 0.258017
chargesum: 0.00000
title: Mulliken charges with hydrogens summed into heavy atoms:
elementType: Cl Cl S N C C C C C C C C C C C
charge: -0.057773 -0.053168 0.238599 -0.019490 -0.307773 0.234300 0.092876 0.361384 -0.052773 -0.083526 -0.116285 -0.192314 0.037674 0.025770 -0.107500
polarizability: 2.38599730e+02 -1.90270643e+01 1.69951166e+02 1.09597246e+01 1.98602870e+01 8.49300210e+01
1716.lowfreq: -7.8934 -3.0628 -0.0036 -0.0032 -0.0032 0.0591 23.1552 44.9169 62.9621
frequency: 23.1211 44.9146 62.9509 81.8274 91.1380 105.2068 164.1416 205.6958 229.6096 255.4183 279.9905 306.4334 372.4221 412.9684 425.8172 453.9500 502.9190 513.7411 574.5883 622.7760 647.0041 663.1329 677.6663 706.8937 723.4365 746.5566 772.8760 785.4180 829.4615 838.8291 850.9773 953.8217 970.1521 991.5694 1001.2458 1041.1696 1069.1903 1081.0183 1103.1155 1125.7178 1151.2708 1187.9496 1231.7451 1252.7142 1277.5148 1291.2500 1310.5198 1329.8550 1365.8136 1397.3299 1452.3455 1456.7391 1463.8911 1472.1901 1528.2104 1577.1944 1602.7665 2990.5602 3057.3827 3064.4916 3144.8044 3151.9253 3158.0580 3173.9354 3178.4250 3225.3394
redmass: 4.6584 9.5070 3.6878 4.6220 4.3794 8.9311 8.3830 5.1907 10.1876 8.8089 5.0979 5.0150 5.5957 2.9692 5.1649 9.3593 5.4936 3.5222 8.8530 7.1520 7.1573 6.4516 6.3976 5.8130 3.3242 5.1754 1.3119 1.3293 1.2779 1.6276 3.8312 1.3369 1.3690 2.1679 2.5803 4.6738 3.9069 2.1121 1.9200 1.8322 1.4769 1.1233 1.2821 1.1874 1.1922 1.3868 2.5047 1.5204 6.2163 3.4735 1.1029 4.3472 1.1486 3.2074 7.6405 7.7229 6.3063 1.0635 1.0618 1.0917 1.1117 1.0884 1.0885 1.0964 1.0977 1.0963
irintensity: 0.0564 0.2779 1.8809 1.1209 0.4582 0.9631 0.8944 0.9659 2.5879 0.2181 4.0821 2.8783 9.6275 0.1088 2.2926 29.5632 0.8541 19.0189 19.5794 0.4321 5.9082 4.5318 3.2389 38.3548 2.0317 34.8365 52.5388 5.2282 12.4502 49.4370 39.0035 0.4798 1.3749 29.8558 16.4266 2.7628 29.0663 18.8625 10.3592 2.4943 11.7598 1.2460 6.4360 10.4483 0.6432 4.2108 3.8727 22.9613 2.7089 7.9341 1.2361 19.8313 14.8995 110.5434 9.6791 2.0435 13.2267 5.9549 12.0350 4.1414 10.2437 6.7128 1.4440 6.2127 0.4064 0.1424
temp: 298.150 k
press: 1.00000 atm
elementType: 17 17 16 7 6 6 6 6 6 6 6 6 6 6 6 1 1 1 1 1 1 1 1 1
symmnumber: 1
zpe: 447421.9 jmol-1
zpe.correction: 0.170414 hartree
zpe.thermalcorrener: 0.184523 hartree
zpe.thermalcorrenthalpy: 0.185467 hartree
zpe.thermalcorrgfe: 0.126479 hartree
zpe.sumelectzpe: -1796.427545 hartree
zpe.sumelectthermal: -1796.413436 hartree
zpe.sumelectthermalent: -1796.412491 hartree
zpe.sumelectthermalfe: -1796.471480 hartree
dipole: 2.0201 -1.6792 0.0786
dipole: 2.6281
quadrupole: -115.9921 -112.3185 -106.9625
quadrupole: -7.7534 1.3419 5.6096
quadrupole: -4.2344 -0.5608 4.7952 -7.7534 1.3419 5.6096
hfenergy: -1796.5979586 hartree
pointgroup: C01 [X(C11H9Cl2N1S1)]
dipole: -0.9254711 0.4227747 -0.1839381 debye
dipolederiv: -0.1791108 -0.000796 -0.0085024 -0.1622066 -0.6668251 0.15071 0.0543627 0.2056389 -0.2402264 -0.9954258 0.0714672 -0.0427117 0.1207077 -0.0883879 0.0292284 -0.0600756 0.0274214 -0.1156481 -0.5459564 -0.1161876 0.0638382 -0.0397623 -0.173197 0.1568681 0.1085476 0.1977989 0.0072482 -0.7732271 -0.2762187 0.1385553 0.0155997 -0.2775132 0.0454502 0.0516396 0.0876412 -0.1896439 0.3195429 -0.1695933 0.0240898 -0.1757633 0.0811863 -0.1190904 -0.0630322 -0.2543123 -0.07924 0.4563037 0.028319 0.0300549 -0.1550395 -0.0450276 0.0489265 0.0642832 0.0034785 0.0098994 -0.0719774 0.0412949 -0.0684383 -0.0124604 -0.0854945 0.0584355 -0.0235263 0.145301 0.0695225 0.2350752 0.0017494 0.0124687 -0.0204005 -0.0117041 0.017113 0.0529402 0.0357794 -0.011361 0.1981209 0.0188926 -0.0217227 0.1415782 0.8344182 -0.2466234 -0.0431886 -0.2141846 0.262087 -0.0472274 -0.0389626 0.0382432 0.0098242 -0.0606892 -0.0941314 -0.0385394 -0.0664273 0.0125459 0.0185151 -0.0138265 -0.0437155 -0.0646288 -0.1230283 -0.0546207 0.006102 -0.0660351 0.0104841 0.4239746 0.4513301 -0.2505435 0.255095 0.2418399 -0.2481457 -0.1937765 -0.2571381 -0.0192962 -0.3094489 0.0649062 -0.1122712 0.0703958 -0.0942235 -0.0353266 -0.1440114 -0.0431204 -0.0230709 -0.4125415 -0.0062267 0.04087 -0.0099896 -0.0834082 -0.0495563 0.1153881 -0.0410423 -0.0127776 1.352529 -0.1408742 0.0662456 -0.1674861 -0.006301 -0.0894832 0.043517 -0.0893964 0.0935771 0.0860634 -0.0124462 0.0206292 -0.0322351 0.0199131 0.0096816 0.0214704 0.0010359 -0.0881757 -0.0155506 0.0460006 0.0097604 0.0960582 0.0507793 0.0087801 -0.0044521 -0.0015256 0.0699807 0.0774071 0.0012995 0.0272352 0.0055194 -0.0142589 0.0392651 -0.0031185 -0.0113782 -0.0885539 -0.0563751 0.0444414 0.0035162 0.0745402 -0.042958 0.0386522 0.0105856 0.0158096 0.0710251 0.0992016 0.0368189 -0.0557453 0.01956 0.1165035 0.0709787 -0.0550384 0.0545106 0.0367327 0.0104045 -0.0193003 0.0943108 -0.0127411 0.1154134 0.0538195 0.1002223 0.0633916 0.0121741 0.0498653 -0.0126869 0.0071298 0.0240371 0.0530722 0.0764697 -0.0234359 0.0772955 0.1463729 0.0216748 -0.0254778 0.0688193 -0.0190507 0.1340687 0.0582943 0.0711644 0.0584222 0.0435622 0.058163 0.0260768 -0.0421163 0.0388486 0.1258222 0.0743049 -0.0480283 0.0710356 0.022782 unknown
polarizability: 243.711839|-0.2754501|138.3258443|1.2491062|-43.7442774|111.4432339 unknown
InChI: InChI=1S/C11H9Cl2NS/c12-6-5-10-11(14-7-15-10)8-1-3-9(13)4-2-8/h1-4,7H,5-6H2
charge 0 multiplicity 1
24 atoms
Cl -2.590688 -4.040458 1.130609
Cl 5.244115 -0.027465 0.151136
S  -3.456734 0.706984 -0.258981
N  -1.234135 1.950713 -1.016486
C  -1.844501 -0.032357 0.136496
C  -0.809995 0.788511 -0.32713
C  -1.781557 -1.374474 0.826521
C  0.648654 0.572408 -0.179679
C  -2.795333 -2.380396 0.253834
C  1.519278 1.045239 -1.200111
C  1.21846 -0.057525 0.96004
C  -2.541597 2.061915 -1.066796
C  2.913875 0.86576 -1.108252
C  2.613685 -0.243968 1.066278
C  3.441513 0.212969 0.023682
H  -1.959274 -1.271995 1.915108
H  -0.765724 -1.788734 0.702747
H  -2.627139 -2.5812 -0.814171
H  -3.840174 -2.085179 0.432684
H  1.089546 1.564518 -2.061786
H  0.584944 -0.366723 1.797035
H  -3.086966 2.877743 -1.539824
H  3.577168 1.227166 -1.899089
H  3.046477 -0.722349 1.949337
