program: Gaussian 09
title: 000208198
version: EM64L-G09RevD.01
frameworkgroup: C1[X(C14H18N2O)]
method: RPBEPBE
basis: SDD
operation: Freq
keyword: #p
keyword: freq=noraman
keyword: PBEPBE/SDD
title: #p freq=noraman PBEPBE/SDD
converged: YES YES NO NO
title: Mulliken charges:
elementType: O N N C C C C C C C C C C C C C C H H H H H H H H H H H H H H H H H H
charge: -0.300054 -0.131449 -0.162148 -0.360522 -0.360036 0.206724 0.002239 0.244647 0.329073 -0.662823 -0.656540 -0.802522 -0.379840 -0.393008 -0.248632 -0.238791 -0.247168 0.206573 0.248785 0.211717 0.240978 0.254092 0.206741 0.213480 0.239776 0.213521 0.214146 0.246337 0.248088 0.241658 0.232997 0.273670 0.220692 0.222408 0.225191
chargesum: 0.00000
title: Mulliken charges with hydrogens summed into heavy atoms:
elementType: O N N C C C C C C C C C C C C C C
charge: -0.300054 -0.131449 -0.162148 0.094836 0.092658 0.206724 0.002239 0.244647 0.329073 0.011490 0.010903 -0.066440 -0.146844 -0.119338 -0.027941 -0.016382 -0.021977
polarizability: 2.53152553e+02 8.53249349e+00 1.78106732e+02 -3.04437467e-01 -1.26477344e+01 9.78495743e+01
1716.lowfreq: -2.4139 -0.0006 -0.0006 -0.0002 3.2142 11.6894 21.8417 37.2316 46.7616
frequency: 21.7899 37.2164 46.6289 59.1646 70.9803 96.1719 104.9537 143.3719 180.2026 191.5419 218.2686 225.9113 243.9663 271.0662 275.5518 316.4126 338.4656 371.7957 408.2721 408.9303 485.4042 496.4828 561.7066 591.5270 615.9242 646.9638 655.1861 684.8454 701.8068 714.7588 778.0817 781.1731 782.6013 851.1412 853.6265 901.5401 916.7988 926.3708 938.8952 980.0388 987.4972 1000.0458 1002.7221 1023.2992 1036.2245 1036.4235 1075.4074 1078.2421 1082.7256 1097.7953 1135.4743 1146.9558 1170.9398 1187.6554 1196.4473 1221.5109 1264.1479 1309.7788 1313.0430 1346.3741 1349.1445 1357.3652 1370.1787 1382.1795 1385.6186 1387.9534 1403.4069 1437.0774 1459.6866 1464.1485 1468.2770 1469.1698 1473.2932 1474.7438 1483.8789 1484.7431 1486.9260 1579.1080 1598.6947 1617.2343 1656.8720 2969.5135 2983.5294 2984.2584 2998.3648 3003.7949 3049.0093 3059.7352 3062.2470 3080.7130 3081.2262 3091.8564 3098.0152 3101.1123 3121.3717 3131.9901 3150.9100 3163.0972 3170.1338
redmass: 2.9460 3.5052 2.8770 2.7156 3.5124 3.7218 2.9652 1.2507 2.8058 2.7892 1.1202 4.1744 1.6186 2.6088 2.6416 2.5433 5.3744 3.1955 3.2342 3.0500 3.6896 3.4643 3.3759 4.1262 6.4012 6.4949 6.3802 8.2421 1.7123 5.0742 1.9645 1.1754 1.2512 4.1120 1.2532 2.7874 3.4982 1.4632 2.2760 1.3800 5.5204 1.3266 3.3739 2.8112 1.4616 1.8432 1.8392 2.0343 1.8436 1.7105 3.7408 2.5502 1.0538 1.2709 2.3801 2.7054 1.7809 1.3988 1.5242 1.4220 1.9014 1.7829 1.7264 4.8770 1.2209 1.2602 1.2930 2.3436 1.0656 1.0550 1.0487 1.0485 1.0614 1.0752 1.0684 1.0742 2.4207 6.0315 8.2892 6.1356 8.6424 1.0404 1.0356 1.0357 1.0617 1.0619 1.0947 1.1015 1.1015 1.0994 1.0991 1.0978 1.1021 1.1018 1.0846 1.0892 1.0939 1.0941 1.0988
irintensity: 0.1012 0.4240 0.0132 0.2477 5.2079 0.7072 0.4907 0.6856 0.5096 0.8067 0.3525 0.3483 0.9108 0.3742 0.3588 0.0993 0.4622 4.2552 5.4896 2.2927 3.1916 6.8397 0.4299 4.4538 0.1535 0.9630 12.8404 20.4218 56.7260 12.0145 43.9685 7.2298 21.8116 5.8862 0.3393 18.3843 38.9880 5.9715 0.9931 0.5503 4.5586 0.8975 35.1239 11.5214 5.2495 0.5351 20.0358 17.5366 17.2706 18.1281 18.7453 46.5888 0.4284 14.2503 25.6881 33.0758 20.8950 30.0460 3.9094 32.1987 38.5319 16.6552 11.7579 15.4360 2.9210 33.7352 5.2995 13.3578 16.0045 16.3410 15.8703 9.3244 9.7544 0.4512 2.7011 25.3797 18.5314 24.9124 113.4308 15.3040 693.5437 37.3303 29.5741 27.7040 38.1934 53.5754 15.3253 0.2802 4.0318 45.4849 44.9892 14.8365 26.0378 45.9670 1.1016 15.7759 36.2833 23.2561 11.5199
temp: 298.150 k
press: 1.00000 atm
elementType: 8 7 7 6 6 6 6 6 6 6 6 6 6 6 6 6 6 1 1 1 1 1 1 1 1 1 1 1 1 1 1 1 1 1 1
symmnumber: 1
zpe: 763808.6 jmol-1
zpe.correction: 0.290919 hartree
zpe.thermalcorrener: 0.308203 hartree
zpe.thermalcorrenthalpy: 0.309147 hartree
zpe.thermalcorrgfe: 0.244103 hartree
zpe.sumelectzpe: -727.746140 hartree
zpe.sumelectthermal: -727.728856 hartree
zpe.sumelectthermalent: -727.727911 hartree
zpe.sumelectthermalfe: -727.792956 hartree
dipole: 2.5546 0.9963 -0.1391
dipole: 2.7455
quadrupole: -84.7076 -92.6185 -105.4570
quadrupole: -4.2182 0.6507 -3.1397
quadrupole: 9.5535 1.6425 -11.1960 -4.2182 0.6507 -3.1397
hfenergy: -728.0370589 hartree
pointgroup: C01[X(C14H18N2O1)]
dipole: 1.006228 0.3611292 -0.1544495 debye
polarizability: 253.0417748|9.7721917|161.4908389|0.9860526|-34.7735661|114.5762449 unknown
InChI: InChI=1S/C14H18N2O/c1-4-16(5-2)14-15-13(11(3)17-14)12-9-7-6-8-10-12/h6-10H,4-5H2,1-3H3
charge 0 multiplicity 1
35 atoms
O  1.432601 1.345927 -0.684235
N  2.895474 -0.326142 0.184635
N  0.4700 -0.526522 0.250369
C  3.095367 -1.617551 0.878867
C  4.059405 0.47276 -0.249911
C  1.612471 0.090358 -0.047139
C  -0.561757 0.354589 -0.210185
C  0.002176 1.491873 -0.773786
C  -1.975314 -0.017048 -0.037448
C  3.090659 -2.824548 -0.083727
C  4.540286 1.479196 0.819573
C  -0.473635 2.766436 -1.392241
C  -3.040795 0.695833 -0.657186
C  -2.295606 -1.141076 0.775551
C  -4.381636 0.307546 -0.452519
C  -3.636237 -1.527426 0.976265
C  -4.688968 -0.803537 0.367233
H  4.056012 -1.559012 1.424592
H  2.288726 -1.735239 1.623843
H  4.87252 -0.23392 -0.502387
H  3.793845 1.011546 -1.176092
H  2.113632 -2.899323 -0.590698
H  3.881007 -2.730158 -0.850765
H  3.26418 -3.762564 0.475669
H  3.748325 2.215489 1.039884
H  4.807706 0.964603 1.760359
H  5.432574 2.025157 0.46061
H  -1.319924 3.192092 -0.823826
H  0.342987 3.508175 -1.392253
H  -0.804746 2.632366 -2.440641
H  -2.82784 1.542176 -1.317189
H  -1.471112 -1.694017 1.235661
H  -5.187886 0.867873 -0.939978
H  -3.862424 -2.39449 1.607568
H  -5.731176 -1.104022 0.52293
