program: Gaussian 09
title: 000210510
version: EM64L-G09RevD.01
frameworkgroup: C1[X(C16H25ClN2O3)]
method: RPBEPBE
basis: SDD
operation: Freq
keyword: #p
keyword: freq=noraman
keyword: PBEPBE/SDD
title: #p freq=noraman PBEPBE/SDD
converged: YES YES NO NO
title: Mulliken charges:
elementType: Cl O O O N N C C C C C C C C C C C C C C C C H H H H H H H H H H H H H H H H H H H H H H H H H
charge: -0.034708 -0.245102 -0.462041 -0.254288 -0.088642 -0.171911 -0.353968 -0.357270 -0.329551 -0.344610 -0.412363 -0.325472 -0.317462 -0.005729 -0.631199 -0.377348 0.504505 -0.321567 -0.323396 -0.209965 -0.242832 -0.246758 0.198662 0.203139 0.218356 0.224030 0.207402 0.195507 0.194570 0.208717 0.232019 0.207034 0.192095 0.217182 0.214660 0.191955 0.201945 0.225788 0.234371 0.208910 0.257998 0.206325 0.360285 0.232023 0.255286 0.229075 0.234341
chargesum: 0.00000
title: Mulliken charges with hydrogens summed into heavy atoms:
elementType: Cl O O O N N C C C C C C C C C C C C C C C C
charge: -0.034708 -0.245102 -0.101756 -0.254288 -0.088642 -0.171911 0.047834 0.085116 0.073358 0.058676 0.026690 0.083806 0.089154 0.196216 0.037870 0.086975 0.504505 -0.321567 -0.091374 0.045321 -0.013757 -0.012417
polarizability: 2.23251620e+02 3.71628054e+00 2.09814433e+02 -2.88937961e+01 9.28499776e+00 1.77491976e+02
1716.lowfreq: -16.8412 -4.2227 -0.0015 -0.0014 -0.0005 4.3244 7.3845 11.5496 14.9301
frequency: -15.2498 11.3496 14.0584 25.0494 34.8438 58.0312 71.8441 89.9253 99.9752 123.6658 145.8846 169.9392 193.7079 196.9261 219.0039 231.9483 233.9988 247.6312 289.6062 295.2519 312.8939 357.7267 379.5743 387.0404 388.5836 394.2922 430.7056 435.5140 449.4569 471.1162 487.6459 518.4964 536.8562 553.8626 570.8270 607.0121 662.7770 702.0224 706.1358 747.4302 760.8751 770.3637 786.3356 810.3598 828.0399 833.2444 840.7630 848.3793 901.3639 916.2774 922.8399 966.0118 967.9518 998.4707 1017.0868 1022.5006 1028.2396 1033.5445 1039.1927 1046.5612 1053.3672 1057.9287 1077.4877 1084.4134 1086.9113 1103.8147 1120.5163 1124.7749 1131.0456 1138.7801 1168.8635 1174.8618 1191.9951 1199.6716 1221.0364 1239.7067 1244.9926 1252.8564 1259.5801 1263.5368 1275.5075 1280.4467 1293.7899 1300.3820 1302.5618 1327.1853 1336.9438 1342.6647 1351.5365 1357.6303 1370.4809 1376.1329 1376.2908 1398.1073 1415.8972 1428.1956 1431.6567 1442.4788 1447.1093 1450.8023 1457.9171 1458.5898 1464.8742 1469.6570 1474.0504 1481.8499 1486.5635 1487.7229 1573.4731 1601.4975 2861.9484 2864.6300 2877.9670 2904.3528 2929.7346 2942.8487 2951.0745 2953.8016 2957.8202 3015.9760 3024.4285 3024.7849 3038.0364 3038.3913 3041.9591 3050.5980 3081.4513 3084.6783 3090.2840 3103.9403 3137.1316 3154.2225 3166.1417 3177.5844 3228.9977
redmass: 3.0661 8.4370 5.2629 4.7875 5.5068 5.6978 3.9232 3.2684 3.2926 4.5858 4.7652 3.2560 3.7608 3.6154 1.1721 1.9837 3.3175 4.5330 4.1495 3.0988 2.2925 4.5329 3.5996 2.4798 4.1547 2.3839 3.0862 3.2137 2.5487 2.7595 3.1387 4.3724 3.9157 5.6775 4.0367 1.9539 6.2702 1.0836 3.3537 1.3097 3.4283 5.5087 1.3428 3.6129 2.2439 1.5997 1.8231 2.5400 2.3567 1.8038 1.3811 1.4328 5.0238 2.8277 2.5814 6.0977 2.1962 2.7058 2.0306 2.0769 1.9683 2.3507 2.4018 2.7033 3.2025 1.9389 1.6131 2.2227 1.6836 2.7935 1.2527 1.4374 1.1084 1.5544 1.7441 2.0412 1.3716 1.4459 1.5279 1.3761 1.3454 1.1009 1.2212 1.1966 1.2415 1.3083 1.2423 1.2949 1.3411 1.3201 1.3197 7.6937 1.3497 1.4077 1.6334 2.2173 1.1590 1.0826 1.0814 1.0962 1.0919 1.1226 2.5477 1.0918 1.0534 1.0544 1.0836 1.0877 6.3386 7.2100 1.0699 1.0710 1.0689 1.0521 1.0673 1.0717 1.0752 1.0666 1.0666 1.0879 1.0612 1.0895 1.0904 1.0794 1.0957 1.0940 1.0960 1.0978 1.1009 1.1042 1.0858 1.0897 1.0936 1.1002 1.0635
irintensity: 0.0005 0.5441 0.1335 0.9700 0.8543 1.7876 0.5868 0.2623 1.7174 0.8534 1.9673 1.0721 4.9720 5.0055 1.9451 2.2976 1.1916 0.7569 3.2079 1.9093 7.3032 13.8817 3.6663 3.9199 0.3579 1.0481 5.9004 7.5933 4.9004 1.8080 1.2633 12.5778 0.6671 9.3531 9.4997 4.5843 17.7259 88.9571 1.5734 106.4084 15.5268 2.0949 4.1454 21.3029 8.3790 4.7326 0.3107 4.6151 8.4880 13.3950 2.4132 8.2738 90.4841 19.9217 58.2372 72.2257 9.9339 44.5834 19.5667 16.0367 11.4547 11.4697 35.8768 16.8050 24.8492 16.0747 3.1219 20.3579 35.5352 39.8705 3.5353 6.0269 1.2596 5.1922 34.1122 127.3685 16.6152 14.9657 37.7792 10.5229 11.4443 33.1776 3.2730 3.5719 4.3794 8.4769 5.5729 17.6926 2.4238 0.3745 1.0043 15.0388 1.6334 1.7042 43.0597 20.4655 6.0659 2.5085 2.0986 19.2935 5.0711 5.2527 149.7816 3.9705 12.7615 15.8735 21.0439 7.8395 14.0981 49.2444 43.6301 33.8432 141.2162 82.2572 53.5651 57.2172 51.4199 28.1891 110.4422 4.8218 29.5466 46.0846 26.2853 42.0362 29.1678 55.9733 41.0127 33.1011 35.2067 14.0917 2.9205 10.2491 19.6506 10.3031 171.5668
temp: 298.150 k
press: 1.00000 atm
elementType: 17 8 8 8 7 7 6 6 6 6 6 6 6 6 6 6 6 6 6 6 6 6 1 1 1 1 1 1 1 1 1 1 1 1 1 1 1 1 1 1 1 1 1 1 1 1 1
symmnumber: 1
zpe: 1030893.5 jmol-1
zpe.correction: 0.392647 hartree
zpe.thermalcorrener: 0.414586 hartree
zpe.thermalcorrenthalpy: 0.415530 hartree
zpe.thermalcorrgfe: 0.337943 hartree
zpe.sumelectzpe: -1418.136609 hartree
zpe.sumelectthermal: -1418.114669 hartree
zpe.sumelectthermalent: -1418.113725 hartree
zpe.sumelectthermalfe: -1418.191313 hartree
dipole: 0.1376 -3.6251 -3.7782
dipole: 5.2379
quadrupole: -147.1694 -138.5453 -144.6994
quadrupole: 4.0824 -5.7596 4.1580
quadrupole: -3.6981 4.9261 -1.2280 4.0824 -5.7596 4.1580
hfenergy: -1418.5292557 hartree
pointgroup: C01 [X(C16H25Cl1N2O3)]
dipole: -0.0172179 1.2411793 1.6449317 debye
polarizability: 209.3840152|-9.975785|210.1979379|35.154125|5.8810016|190.9760753 unknown
InChI: InChI=1S/C16H25ClN2O3/c1-18(6-7-19-8-10-21-11-9-19)12-14(20)13-22-16-5-3-2-4-15(16)17/h2-5,14,20H,6-13H2,1H3
charge 0 multiplicity 1
47 atoms
Cl 3.521261 -3.575938 -0.532575
O  -6.316009 -1.09315 -1.470985
O  0.841933 2.024393 -2.20174
O  3.085457 -0.726702 -1.130263
N  -4.000588 0.427669 -0.573012
N  -0.508781 1.815668 0.125609
C  -2.826528 1.322321 -0.702908
C  -1.600444 0.800026 0.07887
C  -3.846413 -0.853133 -1.314745
C  -5.263188 1.100014 -0.981718
C  0.860474 1.222687 0.098929
C  -5.065824 -1.756424 -1.066537
C  -6.461103 0.170847 -0.729764
C  1.203267 0.872911 -1.372841
C  -0.695169 2.805369 1.212351
C  2.688282 0.595803 -1.65476
C  3.718148 -0.854677 0.105397
C  4.010551 -2.181685 0.525799
C  4.112422 0.214366 0.951498
C  4.668162 -2.443081 1.739096
C  4.777271 -0.044184 2.171109
C  5.05801 -1.36784 2.572363
H  -2.531133 1.488126 -1.7697
H  -3.115355 2.309026 -0.293027
H  -1.928379 0.507301 1.102105
H  -1.202466 -0.107992 -0.408058
H  -2.938743 -1.378635 -0.965904
H  -3.739291 -0.672016 -2.414347
H  -5.246391 1.384654 -2.064128
H  -5.384699 2.025362 -0.386796
H  0.965788 0.336636 0.762033
H  1.562901 2.001242 0.450443
H  -5.115323 -2.022517 0.011541
H  -5.009402 -2.674811 -1.67386
H  -7.398987 0.621469 -1.094374
H  -6.544512 -0.040978 0.358218
H  0.629315 -0.025894 -1.689039
H  -1.696729 3.262513 1.136538
H  0.052547 3.611551 1.115688
H  -0.601669 2.354043 2.227868
H  2.824152 0.515293 -2.745136
H  3.334088 1.41048 -1.280203
H  0.056353 2.41569 -1.700622
H  3.912531 1.249975 0.662947
H  4.873642 -3.478988 2.025247
H  5.075105 0.797772 2.805239
H  5.572165 -1.56966 3.516953
