program: Gaussian 09
title: 000210426
version: EM64L-G09RevD.01
frameworkgroup: C1[X(C10H22N2O)]
method: RPBEPBE
basis: SDD
operation: Freq
keyword: #p
keyword: freq=noraman
keyword: PBEPBE/SDD
title: #p freq=noraman PBEPBE/SDD
converged: YES YES NO NO
title: Mulliken charges:
elementType: O N N C C C C C C C C C C H H H H H H H H H H H H H H H H H H H H H H
charge: -0.332371 -0.135216 -0.415558 -0.382651 -0.441508 -0.335199 -0.351324 -0.337962 -0.330493 0.292538 -0.697011 -0.690645 -0.609782 0.252694 0.193272 0.209987 0.221981 0.228803 0.175684 0.202365 0.206065 0.186549 0.203449 0.196450 0.190324 0.216974 0.214845 0.207340 0.211509 0.218367 0.214270 0.303290 0.280612 0.215450 0.216903
chargesum: 0.00000
title: Mulliken charges with hydrogens summed into heavy atoms:
elementType: O N N C C C C C C C C C C
charge: -0.332371 -0.135216 -0.112268 0.063315 -0.009540 0.069289 0.057107 0.052036 0.056280 0.292538 -0.057852 -0.046500 0.103183
polarizability: 1.46541791e+02 3.97571853e+00 1.36605611e+02 5.49851065e+00 6.10388752e-03 1.01272769e+02
1716.lowfreq: -14.8368 -7.4383 -0.0003 -0.0001 0.0004 4.8028 20.2522 36.9980 45.1211
frequency: 20.1855 36.9469 44.9767 63.1782 70.9878 79.0556 107.9889 110.2965 121.9165 147.6026 153.3809 213.6179 226.3491 232.9491 244.3353 268.0790 319.7191 368.2538 392.4714 395.2311 435.5369 455.5160 586.6023 621.1662 709.0076 733.6341 735.3261 784.8975 791.8327 815.1932 897.4590 900.0074 921.4664 922.8542 978.7573 1004.8363 1028.3446 1067.6555 1072.7107 1102.8034 1110.0590 1112.6104 1114.2669 1127.4294 1130.0512 1190.4379 1203.6008 1220.4956 1246.7268 1260.0180 1266.1177 1276.0170 1285.7259 1290.7978 1306.6863 1336.9697 1344.5208 1353.3408 1366.9758 1382.6722 1388.4554 1391.8200 1415.0789 1446.3749 1463.2996 1467.4681 1470.0778 1475.0272 1476.0928 1477.0516 1477.8711 1487.1971 1487.8574 1489.7826 1499.6659 1520.1243 1603.7013 2957.9969 2961.6085 2961.9673 2965.6732 2968.7023 2973.2875 2975.0830 2977.6201 2978.1833 3002.2300 3009.6924 3018.9700 3038.8061 3040.3584 3045.2100 3067.9677 3071.8945 3072.1620 3074.9433 3075.0792 3104.6031 3589.4709
redmass: 3.4756 2.9425 3.1804 2.4916 1.6285 1.7003 2.2410 1.3765 2.2673 3.1066 3.1244 2.4517 1.2818 1.1698 2.3892 3.6244 3.6345 2.5454 2.8627 2.8587 2.1846 1.5757 3.9358 3.8075 10.4792 1.0736 1.0864 1.1939 1.1974 3.7431 1.7591 1.7236 1.3664 1.2193 2.7551 4.0495 3.4630 2.5251 2.4956 1.6213 2.2697 2.3686 2.2791 1.2923 1.6048 2.1213 2.0136 1.6490 1.8251 1.2960 1.2784 1.3056 1.0798 1.0870 1.3483 1.4019 1.4873 1.4814 1.3465 1.6313 1.2150 1.2126 1.2016 1.0929 1.3225 1.0714 1.0714 1.0594 1.0594 1.0525 1.0530 1.0776 1.0823 1.0465 1.0964 1.5895 5.5585 1.0635 1.0595 1.0594 1.0359 1.0629 1.0368 1.0392 1.0624 1.0625 1.0978 1.0961 1.0978 1.1026 1.0977 1.1037 1.0999 1.0995 1.1005 1.1007 1.0995 1.0964 1.0766
irintensity: 0.2533 1.7188 1.2927 8.1547 0.6502 0.4751 0.1914 0.6603 1.5336 3.5125 0.0924 0.6173 0.1566 0.0488 1.1470 0.2665 12.8924 11.4038 7.6620 9.4369 20.9713 96.2257 2.6293 1.3428 16.8102 4.7431 14.9641 0.2056 0.3788 8.1152 4.9137 13.8201 5.9884 3.5451 0.8350 5.6400 2.4357 0.3229 1.2980 27.4360 10.8574 22.8797 8.2510 1.6839 23.3059 21.1594 12.2673 111.0961 14.3364 3.0612 1.2320 56.8130 5.9759 5.3133 27.6818 2.7132 1.1292 18.2056 7.2222 23.7194 9.8180 8.7676 42.4021 17.4220 169.6224 1.0320 4.4763 8.0085 2.3548 8.1406 19.6762 0.7874 23.2063 12.8802 22.1739 211.5036 266.0649 7.7264 37.3516 12.7428 112.8928 37.8859 41.4647 24.6323 24.2326 95.8911 7.0434 10.5669 2.0038 47.7829 17.5711 54.4835 29.7764 88.8507 30.7205 88.4534 42.5325 1.2402 6.6635
temp: 298.150 k
press: 1.00000 atm
elementType: 8 7 7 6 6 6 6 6 6 6 6 6 6 1 1 1 1 1 1 1 1 1 1 1 1 1 1 1 1 1 1 1 1 1 1
symmnumber: 1
zpe: 819903.2 jmol-1
zpe.correction: 0.312285 hartree
zpe.thermalcorrener: 0.329594 hartree
zpe.thermalcorrenthalpy: 0.330539 hartree
zpe.thermalcorrgfe: 0.264900 hartree
zpe.sumelectzpe: -577.919920 hartree
zpe.sumelectthermal: -577.902610 hartree
zpe.sumelectthermalent: -577.901665 hartree
zpe.sumelectthermalfe: -577.967304 hartree
dipole: 2.9802 -2.8214 1.7118
dipole: 4.4465
quadrupole: -78.7342 -84.9185 -83.9396
quadrupole: 6.9527 1.4389 4.4625
quadrupole: 3.7966 -2.3877 -1.4088 6.9527 1.4389 4.4625
hfenergy: -578.2322041 hartree
pointgroup: C01 [X(C10H22N2O1)]
dipole: -1.1551145 1.1352887 0.6612533 debye
polarizability: 146.9195196|3.7439426|136.4024495|-4.6682509|0.4493758|101.0982012 unknown
InChI: InChI=1S/C10H22N2O/c1-4-6-8-12(9-7-5-2)10(13)11-3/h11H,4-9H2,1-3H3
charge 0 multiplicity 1
35 atoms
O  0.75631 -2.347495 -0.726168
N  0.059837 -0.210252 -0.07223
N  -1.305726 -2.114093 0.348724
C  1.281375 0.374107 -0.667619
C  -0.882595 0.694149 0.610912
C  2.450591 0.512434 0.335076
C  -2.062649 1.170047 -0.275754
C  3.696443 1.161016 -0.309584
C  -3.000584 2.151645 0.463238
C  -0.117381 -1.595633 -0.179516
C  4.88204 1.282543 0.67189
C  -4.17456 2.630601 -0.417528
C  -1.577713 -3.553171 0.312092
H  1.59428 -0.281837 -1.498258
H  1.02296 1.366343 -1.090287
H  -1.266685 0.220774 1.538582
H  -0.312719 1.581395 0.947642
H  2.705341 -0.496307 0.712284
H  2.130204 1.115905 1.210102
H  -2.643735 0.296638 -0.634951
H  -1.651618 1.658347 -1.181665
H  3.432155 2.166836 -0.69766
H  4.004324 0.558411 -1.188028
H  -2.415127 3.02874 0.807819
H  -3.398656 1.6664 1.378625
H  5.183776 0.287728 1.049474
H  5.763275 1.742541 0.187863
H  4.612892 1.905125 1.546227
H  -4.794822 1.777364 -0.750734
H  -4.830354 3.332315 0.129443
H  -3.804781 3.148294 -1.322292
H  -2.02477 -1.491896 0.711825
H  -0.708074 -4.036101 -0.161768
H  -2.479447 -3.783373 -0.287554
H  -1.708409 -3.970337 1.329081
