program: Gaussian 09
title: 000208191
version: EM64L-G09RevD.01
frameworkgroup: C1[X(C10H8ClNS)]
method: RPBEPBE
basis: SDD
operation: Freq
keyword: #p
keyword: freq=noraman
keyword: PBEPBE/SDD
title: #p freq=noraman PBEPBE/SDD
converged: NO YES NO NO
title: Mulliken charges:
elementType: Cl S N C C C C C C C C C C H H H H H H H H
charge: 0.034126 0.330038 0.097743 0.225864 0.357792 -0.316660 -0.388587 -0.388622 -0.747834 -0.215455 -0.215468 -0.452036 -0.235404 0.245041 0.245024 0.231764 0.251058 0.251022 0.229585 0.229582 0.231427
chargesum: 0.00000
title: Mulliken charges with hydrogens summed into heavy atoms:
elementType: Cl S N C C C C C C C C C C
charge: 0.034126 0.330038 0.097743 0.225864 0.357792 -0.316660 -0.143545 -0.143599 -0.013990 0.014130 0.014114 -0.452036 -0.003977
polarizability: 1.92571030e+02 -7.94071386e-01 1.13984010e+02 -2.75754336e-03 -2.09398644e-03 9.80936619e+01
1716.lowfreq: -128.4876 -47.0551 -9.1793 -0.7163 -0.0034 -0.0023 -0.0022 7.7617 67.8616
frequency: -128.4839 -46.9964 67.8570 75.2786 127.0802 194.7006 232.0734 251.1156 287.7080 354.4024 364.6184 399.2427 400.1894 504.7945 511.7985 593.4357 610.4565 633.4079 652.1083 695.8669 704.6063 769.3566 777.7300 854.7784 923.0715 929.9478 977.2907 988.1305 997.1127 1002.7670 1027.1423 1032.5974 1077.0537 1121.2785 1151.9304 1173.0795 1186.7835 1310.4606 1320.0984 1369.8633 1400.5522 1428.4939 1450.4356 1460.6952 1464.6299 1478.5162 1546.1182 1584.8599 1615.2121 2987.7683 3068.6473 3098.6634 3124.7404 3130.7756 3141.8294 3151.6907 3165.9879
redmass: 1.0223 4.1362 5.6528 6.4332 5.3337 5.7168 3.9167 6.3217 10.0517 6.4380 5.2467 8.1602 2.8223 4.1290 10.2343 9.1077 6.5013 5.1829 7.8376 8.5980 1.6519 3.6345 2.4213 1.2441 1.9267 3.0865 1.3877 5.7255 1.3989 2.7217 1.3903 1.8581 1.6009 4.1994 3.7944 1.0537 1.1139 1.3621 5.0977 7.2606 1.1989 2.1787 6.4293 1.0443 1.2484 2.1787 7.3225 6.0250 6.3972 1.0371 1.0985 1.0988 1.0847 1.0879 1.0927 1.0970 1.1018
irintensity: 0.2520 0.1276 0.7119 0.9721 0.6923 0.2655 1.3973 0.0594 3.3120 1.5216 3.5591 3.2959 0.0017 13.8782 1.3255 5.7916 0.0665 11.8225 11.2078 0.4524 54.6449 10.6371 63.3573 0.0011 62.0799 77.3812 0.0100 0.1615 2.2341 17.5463 1.9353 0.5053 9.4664 2.8025 12.5035 0.0049 1.4239 0.2236 18.5098 0.1204 9.7311 7.1193 141.7859 20.1324 14.8494 54.2201 4.9713 1.4142 1.6997 14.4651 10.0562 12.8656 1.2689 0.1779 17.4193 34.8295 21.0139
temp: 298.150 k
press: 1.00000 atm
elementType: 17 16 7 6 6 6 6 6 6 6 6 6 6 1 1 1 1 1 1 1 1
symmnumber: 1
zpe: 394473.6 jmol-1
zpe.correction: 0.150247 hartree
zpe.thermalcorrener: 0.160659 hartree
zpe.thermalcorrenthalpy: 0.161603 hartree
zpe.thermalcorrgfe: 0.113015 hartree
zpe.sumelectzpe: -1297.802920 hartree
zpe.sumelectthermal: -1297.792507 hartree
zpe.sumelectthermalent: -1297.791563 hartree
zpe.sumelectthermalfe: -1297.840151 hartree
dipole: -2.2876 2.9374 0.0007
dipole: 3.7231
quadrupole: -83.7347 -90.5434 -84.5393
quadrupole: 2.9731 -0.0002 -0.0011
quadrupole: 2.5378 -4.2709 1.7331 2.9731 -0.0002 -0.0011
hfenergy: -1297.9531666 hartree
pointgroup: C01 [X(C10H8Cl1N1S1)]
dipole: -0.812345 1.2188926 0.0010155 debye
dipolederiv: -0.5864365 0.3981792 0.0003031 0.4425868 -0.470348 -0.0002991 0.0004242 -0.0003919 -0.0035728 -0.4148771 -0.0797168 0.0000193 -0.0389794 -0.4519159 -0.0002014 0.0001218 -0.0003514 0.147897 -1.1161196 -0.1066699 0.0002048 -0.1039761 -0.4158629 -0.0001328 0.0001392 -0.0001651 -0.1000506 0.6523384 0.0181106 -0.0001371 0.0099789 -0.0174981 0.0000383 -0.0000985 -0.0000923 -0.0429647 0.2139466 0.0773766 0.0000552 -0.0702618 -0.0729289 -0.000094 -0.0001375 -0.0000677 0.0315133 0.3600901 -0.0843768 -0.0001831 -0.0358065 0.204564 0.0003959 -0.0000449 0.0010735 -0.1579223 -0.1253123 -0.0198806 -0.0860296 -0.0205464 -0.1235607 0.0069991 0.0235365 0.0127582 0.0480909 -0.1253219 -0.0199762 0.0860362 -0.0206281 -0.1235592 -0.0072193 -0.0234537 -0.0129863 0.0480473 -0.0404012 0.1626255 -0.000208 0.0351538 -0.0746791 -0.0000762 -0.0000461 -0.0008043 0.0605824 -0.0471279 0.0059764 0.0980286 0.0252388 -0.1423731 0.0111289 0.0791186 0.0004729 0.0752287 -0.0471302 0.0061083 -0.0980008 0.0253577 -0.1423377 -0.011463 -0.0790212 -0.0008238 0.0752682 1.1456063 -0.2734201 -0.0004125 -0.2413137 1.1648699 0.0005366 -0.0004788 0.0008229 -0.1090578 0.1034152 0.0266823 0.0000025 0.0309097 -0.1550753 -0.0000844 -0.0000321 -0.0000769 -0.0499814 0.0564624 -0.0063555 0.0936398 -0.0105982 0.1364998 0.0122812 0.090209 0.0122894 -0.0332231 0.0564095 -0.0062115 -0.0936696 -0.0104817 0.1365364 -0.0120211 -0.0902352 -0.0120339 -0.033219 -0.0305257 -0.1471909 0.0007411 -0.0607748 0.0058665 0.0004138 0.0005614 0.0007225 0.1279458 0.0344312 0.0632569 -0.095953 0.0563266 0.0406465 -0.0158194 -0.0969462 0.0351194 -0.0175481 0.0360243 0.0632184 0.0956128 0.0562596 0.0399627 0.0152168 0.0964197 -0.0358721 -0.0189785 0.0060429 -0.021158 -0.08506 -0.0164737 0.1527426 -0.0080307 -0.1044227 -0.0130208 -0.0683391 0.0060936 -0.0212851 0.0850063 -0.0166237 0.1527083 0.0083742 0.1043808 0.0133696 -0.0683605 -0.1376082 -0.035293 0.0000042 -0.0353477 0.1557421 0.0000569 0.0000055 0.0000581 0.0886441 unknown
polarizability: 192.0270286|-6.5639712|114.5280051|-0.0191|0.0073721|98.0936677 unknown
InChI: InChI=1S/C10H8ClNS/c1-7-9(12-10(11)13-7)8-5-3-2-4-6-8/h2-6H,1H3
charge 0 multiplicity 1
21 atoms
Cl 4.081689 -1.889641 -0.001716
S  3.069443 1.068135 -0.000169
N  1.462193 -1.060973 -0.000915
C  0.620557 0.07461 -0.000182
C  -0.864468 -0.091676 -0.000092
C  1.267343 1.307322 0.000398
C  -1.578942 -0.17331 -1.222841
C  -1.578586 -0.175189 1.222733
C  0.663621 2.687518 0.001653
C  -2.982911 -0.335051 -1.223011
C  -2.982554 -0.33694 1.223061
C  2.724922 -0.725785 -0.000825
C  -3.688264 -0.41673 0.000066
H  -1.031723 -0.118913 -2.170852
H  -1.031099 -0.122241 2.17067
H  1.43461 3.475343 -0.002414
H  0.022065 2.834705 -0.886146
H  0.029583 2.83665 0.89455
H  -3.523457 -0.400596 -2.17386
H  -3.522824 -0.403945 2.173965
H  -4.776601 -0.544791 0.000126
